기록cargoserde1.0.229axum::extract::Query
조건 변경
현재 조건
axum::extract::Query @1.0.229alpine musl · x64 · rust 1 · cargo · rust
3회 중 2회 통과
검증 — 이 네트워크가 이 좌표에서 컨트랙트를 직접 실행했습니다.
샘플 있음 — 이 좌표에 통과와 실패가 모두 기록됨 (1)
- 프로젝트 관측
- 이 좌표에는 없음
- 컨트랙트 검증
- 2 / 3
- 교차 검증
- 서로 다른 peer 2곳 이상에서 재현됨
- 마지막 기록
- 2026-09-15
열어 볼 수 있는 증거
의존성 건강도
이 릴리스의 의존성 조합과 실패 관측 결과
관측된 문제 1건 ·
정상 4건
| 라이브러리 | 버전 | 건강도 | 그 좌표에서 측정된 것 | 프로젝트 |
|---|---|---|---|---|
| serde_core | 1.0.229 | PASS 모든 관측 정상 통과 | 컨트랙트 통과 | 프로젝트-일 81개 |
| serde_derive | 1.0.229 | PASS 모든 관측 정상 통과 | 컨트랙트 통과 | 프로젝트-일 65개 |
| serde_json | 1.0.149 | PASS 모든 관측 정상 통과 | 컨트랙트 통과 | 프로젝트-일 1개 |
| serde_json | 1.0.151 | PASS 모든 관측 정상 통과 | 컨트랙트 통과 | 프로젝트-일 7개 |
측정 열은 각 의존성 자신의 릴리스에 대한 것이지 두 릴리스의 조합에 대한 것이 아닙니다. 리졸버가 둘을 나란히 놓았다는 사실은 함께 동작한다는 증거가 아닙니다.
최근 실패 클러스터
-
관측됨 PROJECT_COMPILE exit 101 ×5 1.0.229 os=linux sha256:113664d7d918…error: could not compile `probe_icu` (bin <str>) due to 1 previous errorrust/rustc · compiler-diagnostic · outer cargo run증거 품질: complete · 환경 변형: 1 · 최초 관측: 2026-09-20 · 마지막 관측: 2026-09-20
-
관측됨 PROJECT_TEST 증거 공백 ×1 1.0.229 executionContext=rust · os=linux · runtime=rust@1증거 품질: legacy-evidence-incomplete · 환경 변형: 1 · 최초 관측: 2026-09-08 · 마지막 관측: 2026-09-08
-
관측됨 PROJECT_COMPILE exit 101 E0599 ×1 1.0.229 os=linux sha256:0fbd73add053…error[E0599]: no method named `is_empty` found for struct `Char16Trie<'data>` in the current scoperust/rustc · compiler-diagnostic · outer cargo run증거 품질: complete · 환경 변형: 1 · 최초 관측: 2026-09-20 · 마지막 관측: 2026-09-20
-
관측됨 PROJECT_COMPILE exit 101 E0599 ×1 1.0.229 os=linux sha256:16d23d1801b1…error[E0599]: no method named `normalize` found for struct `ComposingNormalizer` in the current scoperust/rustc · compiler-diagnostic · outer cargo run증거 품질: complete · 환경 변형: 1 · 최초 관측: 2026-09-20 · 마지막 관측: 2026-09-20
-
관측됨 PROJECT_COMPILE exit 101 E0277 ×1 1.0.229 os=linux sha256:208766dc43dd…error[E0277]: the trait bound `DirectULE: AsULE` is not satisfied · error[E0277]: the size for values of type `[_]` cannot be known at compilation timerust/rustc · compiler-diagnostic · outer cargo run증거 품질: complete · 환경 변형: 1 · 최초 관측: 2026-09-21 · 마지막 관측: 2026-09-21
-
관측됨 PROJECT_COMPILE exit 101 E0716 ×1 1.0.229 os=linux sha256:24047988143e…error[E0716]: temporary value dropped while borrowedrust/rustc · compiler-diagnostic · outer cargo run증거 품질: complete · 환경 변형: 1 · 최초 관측: 2026-09-21 · 마지막 관측: 2026-09-21
-
관측됨 PROJECT_COMPILE exit 101 E0599 ×1 1.0.229 os=linux sha256:267702ebcc26…error[E0599]: no associated function or constant named `new_nfc_unstable` found for struct `ComposingNormalizer` in the current scoperust/rustc · compiler-diagnostic · outer cargo run증거 품질: complete · 환경 변형: 1 · 최초 관측: 2026-09-20 · 마지막 관측: 2026-09-20
-
관측됨 PROJECT_COMPILE exit 101 E0599 ×1 1.0.229 os=linux sha256:2c8ce33ea821…error[E0599]: no method named `to_aligned` found for reference `&RawBytesULE<4>` in the current scoperust/rustc · compiler-diagnostic · outer cargo run증거 품질: complete · 환경 변형: 1 · 최초 관측: 2026-09-21 · 마지막 관측: 2026-09-21
-
관측됨 PROJECT_COMPILE exit 101 ×1 1.0.229 os=linux sha256:4518371e6dd8…error: could not compile `test-zerovec` (bin <str>) due to 1 previous errorrust/rustc · compiler-diagnostic · outer cargo run증거 품질: complete · 환경 변형: 1 · 최초 관측: 2026-09-21 · 마지막 관측: 2026-09-21
-
관측됨 PROJECT_COMPILE exit 101 E0609 ×1 1.0.229 os=linux sha256:463107715912…error[E0609]: no field `SINGLETON_NORMALIZER_NFC_V1` on type `MyProvider`rust/rustc · compiler-diagnostic · outer cargo run증거 품질: complete · 환경 변형: 1 · 최초 관측: 2026-09-20 · 마지막 관측: 2026-09-20
-
관측됨 PROJECT_COMPILE exit 101 ×1 1.0.229 os=linux sha256:4880cde154a0…error: could not compile `probe_zerovec` (bin <str>) due to 3 previous errors; 1 warning emittedrust/rustc · compiler-diagnostic · outer cargo run증거 품질: complete · 환경 변형: 1 · 최초 관측: 2026-09-21 · 마지막 관측: 2026-09-21
-
관측됨 PROJECT_COMPILE exit 101 E0277 ×1 1.0.229 os=linux sha256:86285648d445…error[E0277]: the trait bound `Person<'_>: VarULE` is not satisfiedrust/rustc · compiler-diagnostic · outer cargo run증거 품질: complete · 환경 변형: 1 · 최초 관측: 2026-09-21 · 마지막 관측: 2026-09-21
가장 많이 보고된 12개를 보여줍니다. 이 좌표에 기록된 실패 클러스터는 21개입니다. 나머지는 단발 보고입니다.