記録cargoserde1.0.229axum::debug_handler
条件を変更
現在の条件
axum::debug_handler @1.0.229alpine musl · x64 · rust 1 · cargo · rust
3 回中 2 回が成功
検証 — このネットワークがこの座標でコントラクトを実行しました。
サンプルあり — この座標には成功した実行と失敗した実行の両方が記録されている (1)
- プロジェクト観測
- この座標にはなし
- コントラクト検証
- 2 / 3
- クロス検証
- 2 つ以上の独立したピアで再現
- 最終記録
- 2026-09-15
開ける証拠
依存関係のヘルス
このリリースの依存関係の組み合わせと失敗観測
観測された問題 1件 ·
正常 4件
| ライブラリ | バージョン | ヘルス | その座標で測定されたこと | プロジェクト |
|---|---|---|---|---|
| serde_core | 1.0.229 | PASS すべての観測で成功 | コントラクト合格 | プロジェクト日 81 件 |
| serde_derive | 1.0.229 | PASS すべての観測で成功 | コントラクト合格 | プロジェクト日 65 件 |
| serde_json | 1.0.149 | PASS すべての観測で成功 | コントラクト合格 | プロジェクト日 1 件 |
| serde_json | 1.0.151 | PASS すべての観測で成功 | コントラクト合格 | プロジェクト日 7 件 |
測定列は各依存関係自身のリリースに関するもので、2つのリリースの組み合わせに関するものではありません。リゾルバが2つを並べたという事実は、両者が協調して動く証拠ではありません。
最近の失敗クラスター
-
観測済み PROJECT_COMPILE exit 101 ×5 1.0.229 os=linux sha256:113664d7d918…error: could not compile `probe_icu` (bin <str>) due to 1 previous errorrust/rustc · compiler-diagnostic · outer cargo run証拠品質: complete · 環境バリアント: 1 · 初回記録: 2026-09-20 · 最終観測: 2026-09-20
-
観測済み PROJECT_TEST 証拠の欠落 ×1 1.0.229 executionContext=rust · os=linux · runtime=rust@1証拠品質: legacy-evidence-incomplete · 環境バリアント: 1 · 初回記録: 2026-09-08 · 最終観測: 2026-09-08
-
観測済み PROJECT_COMPILE exit 101 E0599 ×1 1.0.229 os=linux sha256:0fbd73add053…error[E0599]: no method named `is_empty` found for struct `Char16Trie<'data>` in the current scoperust/rustc · compiler-diagnostic · outer cargo run証拠品質: complete · 環境バリアント: 1 · 初回記録: 2026-09-20 · 最終観測: 2026-09-20
-
観測済み PROJECT_COMPILE exit 101 E0599 ×1 1.0.229 os=linux sha256:16d23d1801b1…error[E0599]: no method named `normalize` found for struct `ComposingNormalizer` in the current scoperust/rustc · compiler-diagnostic · outer cargo run証拠品質: complete · 環境バリアント: 1 · 初回記録: 2026-09-20 · 最終観測: 2026-09-20
-
観測済み PROJECT_COMPILE exit 101 E0277 ×1 1.0.229 os=linux sha256:208766dc43dd…error[E0277]: the trait bound `DirectULE: AsULE` is not satisfied · error[E0277]: the size for values of type `[_]` cannot be known at compilation timerust/rustc · compiler-diagnostic · outer cargo run証拠品質: complete · 環境バリアント: 1 · 初回記録: 2026-09-21 · 最終観測: 2026-09-21
-
観測済み PROJECT_COMPILE exit 101 E0716 ×1 1.0.229 os=linux sha256:24047988143e…error[E0716]: temporary value dropped while borrowedrust/rustc · compiler-diagnostic · outer cargo run証拠品質: complete · 環境バリアント: 1 · 初回記録: 2026-09-21 · 最終観測: 2026-09-21
-
観測済み PROJECT_COMPILE exit 101 E0599 ×1 1.0.229 os=linux sha256:267702ebcc26…error[E0599]: no associated function or constant named `new_nfc_unstable` found for struct `ComposingNormalizer` in the current scoperust/rustc · compiler-diagnostic · outer cargo run証拠品質: complete · 環境バリアント: 1 · 初回記録: 2026-09-20 · 最終観測: 2026-09-20
-
観測済み PROJECT_COMPILE exit 101 E0599 ×1 1.0.229 os=linux sha256:2c8ce33ea821…error[E0599]: no method named `to_aligned` found for reference `&RawBytesULE<4>` in the current scoperust/rustc · compiler-diagnostic · outer cargo run証拠品質: complete · 環境バリアント: 1 · 初回記録: 2026-09-21 · 最終観測: 2026-09-21
-
観測済み PROJECT_COMPILE exit 101 ×1 1.0.229 os=linux sha256:4518371e6dd8…error: could not compile `test-zerovec` (bin <str>) due to 1 previous errorrust/rustc · compiler-diagnostic · outer cargo run証拠品質: complete · 環境バリアント: 1 · 初回記録: 2026-09-21 · 最終観測: 2026-09-21
-
観測済み PROJECT_COMPILE exit 101 E0609 ×1 1.0.229 os=linux sha256:463107715912…error[E0609]: no field `SINGLETON_NORMALIZER_NFC_V1` on type `MyProvider`rust/rustc · compiler-diagnostic · outer cargo run証拠品質: complete · 環境バリアント: 1 · 初回記録: 2026-09-20 · 最終観測: 2026-09-20
-
観測済み PROJECT_COMPILE exit 101 ×1 1.0.229 os=linux sha256:4880cde154a0…error: could not compile `probe_zerovec` (bin <str>) due to 3 previous errors; 1 warning emittedrust/rustc · compiler-diagnostic · outer cargo run証拠品質: complete · 環境バリアント: 1 · 初回記録: 2026-09-21 · 最終観測: 2026-09-21
-
観測済み PROJECT_COMPILE exit 101 E0277 ×1 1.0.229 os=linux sha256:86285648d445…error[E0277]: the trait bound `Person<'_>: VarULE` is not satisfiedrust/rustc · compiler-diagnostic · outer cargo run証拠品質: complete · 環境バリアント: 1 · 初回記録: 2026-09-21 · 最終観測: 2026-09-21
最も多く報告された 12 件を表示しています。この座標に記録された失敗クラスタは 21 件です。残りは単発の報告です。