Registroscargoserde1.0.229axum::body::Body
Cambiar las condiciones
Condiciones actuales
axum::body::Body @1.0.229alpine musl · x64 · rust 1 · cargo · rust
2 de 3 pasaron
Verificado: esta red ejecutó un contrato en esta coordenada.
hay una muestra aquí y esta coordenada registra a la vez una ejecución con éxito y otra con fallo (1)
- Observaciones de proyectos
- nada en esta coordenada
- Verificaciones de contrato
- 2 / 3
- Verificación cruzada
- reproducido por dos o más peers independientes
- Último registro
- 2026-09-15
Salud de dependencias
Combinaciones observadas y evidencia de fallos para esta versión
Primer fallo observado
1.0.229
linux
5 FAIL
· stage: PROJECT_COMPILE
· fingerprint: sha256:113664d7d9181e86107a4fb50e44d53895730e410223b707c0b72d659b247aef
| Biblioteca | Versión | Estado | Medido allí | Proyectos |
|---|---|---|---|---|
| serde_core | 1.0.229 | PASS Todas las observaciones pasaron | contrato aprobado | 81 días-proyecto |
| serde_derive | 1.0.229 | PASS Todas las observaciones pasaron | contrato aprobado | 65 días-proyecto |
| serde_json | 1.0.149 | PASS Todas las observaciones pasaron | contrato aprobado | 1 día-proyecto |
| serde_json | 1.0.151 | PASS Todas las observaciones pasaron | contrato aprobado | 7 días-proyecto |
La columna de medición se refiere a la versión de cada dependencia en sí, no al par. Que un resolutor haya colocado dos versiones juntas no prueba que funcionen juntas.
Clústeres de fallos recientes
-
observado PROJECT_COMPILE exit 101 ×5 1.0.229 os=linux sha256:113664d7d918…error: could not compile `probe_icu` (bin <str>) due to 1 previous errorrust/rustc · compiler-diagnostic · outer cargo runCalidad de evidencia: complete · Variantes de entorno: 1 · Primer registro: 2026-09-20 · Última observación: 2026-09-20
-
observado PROJECT_TEST Brecha de evidencia ×1 1.0.229 executionContext=rust · os=linux · runtime=rust@1Calidad de evidencia: legacy-evidence-incomplete · Variantes de entorno: 1 · Primer registro: 2026-09-08 · Última observación: 2026-09-08
-
observado PROJECT_COMPILE exit 101 E0599 ×1 1.0.229 os=linux sha256:0fbd73add053…error[E0599]: no method named `is_empty` found for struct `Char16Trie<'data>` in the current scoperust/rustc · compiler-diagnostic · outer cargo runCalidad de evidencia: complete · Variantes de entorno: 1 · Primer registro: 2026-09-20 · Última observación: 2026-09-20
-
observado PROJECT_COMPILE exit 101 E0599 ×1 1.0.229 os=linux sha256:16d23d1801b1…error[E0599]: no method named `normalize` found for struct `ComposingNormalizer` in the current scoperust/rustc · compiler-diagnostic · outer cargo runCalidad de evidencia: complete · Variantes de entorno: 1 · Primer registro: 2026-09-20 · Última observación: 2026-09-20
-
observado PROJECT_COMPILE exit 101 E0277 ×1 1.0.229 os=linux sha256:208766dc43dd…error[E0277]: the trait bound `DirectULE: AsULE` is not satisfied · error[E0277]: the size for values of type `[_]` cannot be known at compilation timerust/rustc · compiler-diagnostic · outer cargo runCalidad de evidencia: complete · Variantes de entorno: 1 · Primer registro: 2026-09-21 · Última observación: 2026-09-21
-
observado PROJECT_COMPILE exit 101 E0716 ×1 1.0.229 os=linux sha256:24047988143e…error[E0716]: temporary value dropped while borrowedrust/rustc · compiler-diagnostic · outer cargo runCalidad de evidencia: complete · Variantes de entorno: 1 · Primer registro: 2026-09-21 · Última observación: 2026-09-21
-
observado PROJECT_COMPILE exit 101 E0599 ×1 1.0.229 os=linux sha256:267702ebcc26…error[E0599]: no associated function or constant named `new_nfc_unstable` found for struct `ComposingNormalizer` in the current scoperust/rustc · compiler-diagnostic · outer cargo runCalidad de evidencia: complete · Variantes de entorno: 1 · Primer registro: 2026-09-20 · Última observación: 2026-09-20
-
observado PROJECT_COMPILE exit 101 E0599 ×1 1.0.229 os=linux sha256:2c8ce33ea821…error[E0599]: no method named `to_aligned` found for reference `&RawBytesULE<4>` in the current scoperust/rustc · compiler-diagnostic · outer cargo runCalidad de evidencia: complete · Variantes de entorno: 1 · Primer registro: 2026-09-21 · Última observación: 2026-09-21
-
observado PROJECT_COMPILE exit 101 ×1 1.0.229 os=linux sha256:4518371e6dd8…error: could not compile `test-zerovec` (bin <str>) due to 1 previous errorrust/rustc · compiler-diagnostic · outer cargo runCalidad de evidencia: complete · Variantes de entorno: 1 · Primer registro: 2026-09-21 · Última observación: 2026-09-21
-
observado PROJECT_COMPILE exit 101 E0609 ×1 1.0.229 os=linux sha256:463107715912…error[E0609]: no field `SINGLETON_NORMALIZER_NFC_V1` on type `MyProvider`rust/rustc · compiler-diagnostic · outer cargo runCalidad de evidencia: complete · Variantes de entorno: 1 · Primer registro: 2026-09-20 · Última observación: 2026-09-20
-
observado PROJECT_COMPILE exit 101 ×1 1.0.229 os=linux sha256:4880cde154a0…error: could not compile `probe_zerovec` (bin <str>) due to 3 previous errors; 1 warning emittedrust/rustc · compiler-diagnostic · outer cargo runCalidad de evidencia: complete · Variantes de entorno: 1 · Primer registro: 2026-09-21 · Última observación: 2026-09-21
-
observado PROJECT_COMPILE exit 101 E0277 ×1 1.0.229 os=linux sha256:86285648d445…error[E0277]: the trait bound `Person<'_>: VarULE` is not satisfiedrust/rustc · compiler-diagnostic · outer cargo runCalidad de evidencia: complete · Variantes de entorno: 1 · Primer registro: 2026-09-21 · Última observación: 2026-09-21
Se muestran los 12 más reportados de 21 grupos de fallos registrados. El resto son reportes únicos.