Recordscargoruzstd0.8.3
Change the conditions
Current conditions
ruzstd @0.8.3alpine musl · x64 · rust 1 · cargo · rust
package-level total, not an API
Recorded as present in projects. Nothing was run at this coordinate.
Observed — real project builds reported from this coordinate.
no sample at this coordinate yet
- Project observations
- nothing at this coordinate
- Contract verifications
- nothing at this coordinate
- Usage records
- 4
- Independent reporting peers
- 1
- Last recorded
- 2026-10-21
Evidence you can open
Dependency Health
Observed combinations and failure evidence for this release
Observed problems 1 ·
Steady 2
First observed break
0.8.3
linux
2 FAIL
· stage: PROJECT_COMPILE
· fingerprint: sha256:40827ed6270443985b87902d50b257ee40df217d061c0098b7070f9287145dc9
| Library | Version | Health | Measured there | Projects |
|---|---|---|---|---|
| twox-hash | 2.1.4 | PASS All observations passed | contract passed | 3 project-days |
| twox-hash | 2.1.5 | PASS All observations passed | builds observed | 10 project-days |
The measured column is about each dependency's own release, not about the pair. A resolver placing two releases side by side is not evidence that they work together.
Recent failure clusters
-
observed PROJECT_COMPILE exit 101 E0599 ×2 0.8.3 os=linux sha256:40827ed62704…error[E0599]: no method named `is_none` found for tuple `(u64, u64, addr2line::Location<'_>)` in the current scoperust/rustc · compiler-diagnostic · outer cargo runEvidence quality: complete · Environment variants: 1 · First recorded: 2026-09-19 · Last seen: 2026-09-19
-
observed PROJECT_TEST exit 101 ×2 0.8.3 os=linux sha256:4f232600c5a8…error: test failed, to rerun pass `--test contract` · running 0 tests …rust/test · test-runner-diagnostic · outer cargo testEvidence quality: complete · Environment variants: 1 · First recorded: 2026-10-20 · Last seen: 2026-10-20
-
observed PROJECT_COMPILE exit 101 ×1 0.8.3 os=linux sha256:7e12f411f813…error: could not compile `test_addr2line` (bin <str>) due to 1 previous errorrust/rustc · compiler-diagnostic · outer cargo runEvidence quality: complete · Environment variants: 1 · First recorded: 2026-09-19 · Last seen: 2026-09-19
-
observed PROJECT_COMPILE exit 101 ×1 0.8.3 os=linux sha256:9d9b6169d6bd…error: could not compile `test_addr2line` (bin <str>) due to 9 previous errorsrust/rustc · compiler-diagnostic · outer cargo runEvidence quality: complete · Environment variants: 1 · First recorded: 2026-09-19 · Last seen: 2026-09-19
-
observed PROJECT_COMPILE exit 101 E0063 ×1 0.8.3 os=linux sha256:b4d73c642e61…error[E0063]: missing fields `debug_macinfo` and `debug_macro` in initializer of `Dwarf<_>`rust/rustc · compiler-diagnostic · outer cargo runEvidence quality: complete · Environment variants: 1 · First recorded: 2026-09-19 · Last seen: 2026-09-19
-
observed PROJECT_COMPILE exit 101 E0061 ×1 0.8.3 os=linux sha256:db7a3103c11e…error[E0061]: this function takes 2 arguments but 1 argument was suppliedrust/rustc · compiler-diagnostic · outer cargo runEvidence quality: complete · Environment variants: 1 · First recorded: 2026-09-19 · Last seen: 2026-09-19
-
observed UNKNOWN exit 101 Evidence gap ×1 0.8.3 os=linux sha256:c970c257481f…Compiling cfg-if v1.0.5 · Compiling simd-adler32 v0.3.10 · Compiling adler2 v2.0.1 · Compiling crc32fast v1.5.2cargo · unclassified-diagnostic · outer cargo run · gap stage-unknownEvidence quality: complete · Environment variants: 1 · First recorded: 2026-09-19 · Last seen: 2026-09-19Diagnostic re-verification candidate
-
observed PROJECT_COMPILE exit 101 ×1 0.8.3 os=linux sha256:aaf1990e27c5…error: could not compile `sample-addr2line` (test <str>) due to 2 previous errors …rust/rustc · compiler-diagnostic · outer cargo testEvidence quality: complete · Environment variants: 1 · First recorded: 2026-10-19 · Last seen: 2026-10-19
-
observed PROJECT_COMPILE exit 101 E0432 ×1 0.8.3 os=linux sha256:ac7324fdd333…error[E0432]: unresolved import `addr2line::object`rust/rustc · compiler-diagnostic · outer cargo testEvidence quality: complete · Environment variants: 1 · First recorded: 2026-10-19 · Last seen: 2026-10-19
-
observed PROJECT_COMPILE exit 101 E0599 ×1 0.8.3 os=linux sha256:ff95f88fed26…error[E0599]: no associated function or constant named `new` found for struct `addr2line::Context<R>` in the current scoperust/rustc · compiler-diagnostic · outer cargo testEvidence quality: complete · Environment variants: 1 · First recorded: 2026-10-19 · Last seen: 2026-10-19
-
observed PROJECT_TEST exit 101 E0432 ×1 0.8.3 os=linux sha256:c4faf3580ad8…34 | let ctx = Context::new(&obj_file).expect(<str>); · | ^^^ associated function or constant not found in `addr2line::Context<_>` · | …rust/test · test-runner-diagnostic · outer cargo testEvidence quality: complete · Environment variants: 1 · First recorded: 2026-10-19 · Last seen: 2026-10-19
-
observed PROJECT_COMPILE exit 101 E0308 ×1 0.8.3 os=linux sha256:0479254218ac…error[E0308]: mismatched typesrust/rustc · compiler-diagnostic · outer cargo runEvidence quality: complete · Environment variants: 1 · First recorded: 2026-10-19 · Last seen: 2026-10-19
Showing the 12 most-reported of 13 recorded failure clusters. The rest are single reports.