Relevéscargoregex-automata0.4.18
Changer les conditions
Conditions actuelles
regex-automata @0.4.18alpine musl · x64 · rust 1 · cargo · rust
total du paquet, pas une API
Enregistré comme présent dans des projets. Rien n'a été exécuté à cette coordonnée.
Observé — de vrais builds de projets ont fait remonter cette coordonnée.
pas encore d'échantillon à cette coordonnée
- Observations de projets
- rien à cette coordonnée
- Vérifications de contrat
- rien à cette coordonnée
- Enregistrements d'usage
- 1
- Pairs rapporteurs indépendants
- 1
- Dernier enregistrement
- 2026-09-08
Preuves que vous pouvez ouvrir
Santé des dépendances
Combinaisons observées et preuves d'échec pour cette version
Problèmes observés : 1 ·
Inconnu(s) : 1 ·
Stable(s) : 2
Premier échec observé
0.4.18
linux
5 FAIL
· stage: PROJECT_COMPILE
· fingerprint: sha256:113664d7d9181e86107a4fb50e44d53895730e410223b707c0b72d659b247aef
| Bibliothèque | Version | Santé | Mesuré là-bas | Projets |
|---|---|---|---|---|
| regex-syntax | 0.8.11 | UNKNOWN Aucun résultat mesuré lié | rien de mesuré | 3 jours-projet |
| aho-corasick | 1.1.5 | PASS Toutes les observations ont réussi | builds observés | 3 jours-projet |
| memchr | 2.8.3 | PASS Toutes les observations ont réussi | contrat réussi | 3 jours-projet |
La colonne de mesure porte sur la version de chaque dépendance elle-même, pas sur la paire. Qu'un résolveur ait placé deux versions côte à côte ne prouve pas qu'elles fonctionnent ensemble.
Clusters d'échecs récents
-
observé PROJECT_COMPILE exit 101 ×5 0.4.18 os=linux sha256:113664d7d918…error: could not compile `probe_icu` (bin <str>) due to 1 previous errorrust/rustc · compiler-diagnostic · outer cargo runQualité de preuve: complete · Variantes d’environnement: 1 · Premier relevé: 2026-09-20 · Dernière observation: 2026-09-20
-
observé PROJECT_COMPILE exit 101 E0599 ×1 0.4.18 os=linux sha256:0fbd73add053…error[E0599]: no method named `is_empty` found for struct `Char16Trie<'data>` in the current scoperust/rustc · compiler-diagnostic · outer cargo runQualité de preuve: complete · Variantes d’environnement: 1 · Premier relevé: 2026-09-20 · Dernière observation: 2026-09-20
-
observé PROJECT_COMPILE exit 101 E0599 ×1 0.4.18 os=linux sha256:16d23d1801b1…error[E0599]: no method named `normalize` found for struct `ComposingNormalizer` in the current scoperust/rustc · compiler-diagnostic · outer cargo runQualité de preuve: complete · Variantes d’environnement: 1 · Premier relevé: 2026-09-20 · Dernière observation: 2026-09-20
-
observé PROJECT_COMPILE exit 101 E0599 ×1 0.4.18 os=linux sha256:267702ebcc26…error[E0599]: no associated function or constant named `new_nfc_unstable` found for struct `ComposingNormalizer` in the current scoperust/rustc · compiler-diagnostic · outer cargo runQualité de preuve: complete · Variantes d’environnement: 1 · Premier relevé: 2026-09-20 · Dernière observation: 2026-09-20
-
observé PROJECT_COMPILE exit 101 E0609 ×1 0.4.18 os=linux sha256:463107715912…error[E0609]: no field `SINGLETON_NORMALIZER_NFC_V1` on type `MyProvider`rust/rustc · compiler-diagnostic · outer cargo runQualité de preuve: complete · Variantes d’environnement: 1 · Premier relevé: 2026-09-20 · Dernière observation: 2026-09-20
-
observé PROJECT_COMPILE exit 101 E0599 ×1 0.4.18 os=linux sha256:f752258b26cc…error[E0599]: no method named `as_bytes` found for reference `&Char16Trie<'_>` in the current scoperust/rustc · compiler-diagnostic · outer cargo runQualité de preuve: complete · Variantes d’environnement: 1 · Premier relevé: 2026-09-20 · Dernière observation: 2026-09-20