記録cargoquote1.0.47quote::ToTokens
条件を変更
現在の条件
quote::ToTokens @1.0.47ubuntu glibc · x64 · cargo 1
10 回中 5 回が成功
観測 — 実際のプロジェクトのビルドがこの座標から報告されました。
サンプルあり — この座標ではまだ実行していない (1)
- プロジェクト観測
- 5 / 10
- コントラクト検証
- この座標にはなし
- 独立した報告ピア
- 2
- 最終記録
- 2026-09-14
開ける証拠
依存関係のヘルス
このリリースの依存関係の組み合わせと失敗観測
観測された問題 1件 ·
正常 1件
| ライブラリ | バージョン | ヘルス | その座標で測定されたこと | プロジェクト |
|---|---|---|---|---|
| proc-macro2 | 1.0.107 | PASS すべての観測で成功 | コントラクト合格 | プロジェクト日 223 件 |
測定列は各依存関係自身のリリースに関するもので、2つのリリースの組み合わせに関するものではありません。リゾルバが2つを並べたという事実は、両者が協調して動く証拠ではありません。
最近の失敗クラスター
-
観測済み PROJECT_COMPILE exit 101 ×1 1.0.47 os=linux quote::ToTokens sha256:0d5a8e2ccc86…error: could not compile `quote-test` (bin <str>) due to 1 previous error; 1 warning emittedrust/rustc · compiler-diagnostic · outer cargo run証拠品質: complete · 環境バリアント: 1 · 初回記録: 2026-09-14 · 最終観測: 2026-09-14
-
観測済み PROJECT_COMPILE exit 101 E0432 ×1 1.0.47 os=linux quote::ToTokens sha256:4a6dd64b7a9b…error[E0432]: unresolved import `proc_macro2`rust/rustc · compiler-diagnostic · outer cargo test証拠品質: complete · 環境バリアント: 1 · 初回記録: 2026-09-14 · 最終観測: 2026-09-14
-
観測済み PROJECT_COMPILE exit 101 E0277 ×1 1.0.47 os=linux quote::ToTokens sha256:ab12e03ad4b1…error[E0277]: the trait bound `i32: IdentFragment` is not satisfiedrust/rustc · compiler-diagnostic · outer cargo run証拠品質: complete · 環境バリアント: 1 · 初回記録: 2026-09-14 · 最終観測: 2026-09-14
-
観測済み PROJECT_COMPILE exit 101 ×1 1.0.47 os=linux quote::ToTokens sha256:b53ce471a520…error: could not compile `test-quote` (lib) due to 1 previous error; 1 warning emittedrust/rustc · compiler-diagnostic · outer cargo test証拠品質: complete · 環境バリアント: 1 · 初回記録: 2026-09-14 · 最終観測: 2026-09-14
-
観測済み PROJECT_TEST exit 101 ×1 1.0.47 os=linux quote::ToTokens sha256:cc325a11570b…error: test failed, to rerun pass `--lib` · running 6 tests · test tests::test_quote_basic_tokens ... ok …rust/test · test-runner-diagnostic · outer cargo test証拠品質: complete · 環境バリアント: 1 · 初回記録: 2026-09-14 · 最終観測: 2026-09-14
-
観測済み PROJECT_COMPILE exit 101 E0433 ×1 1.0.47 os=linux sha256:4cea35867957…error[E0433]: cannot find `__private229` in `_serde` · error[E0433]: cannot find `Serializer` in `_serde` · error[E0433]: cannot find `ser` in `_serde`rust/rustc · compiler-diagnostic · outer cargo check証拠品質: complete · 環境バリアント: 1 · 初回記録: 2026-09-14 · 最終観測: 2026-09-14
-
観測済み PROJECT_COMPILE exit 101 E0283 ×1 1.0.47 os=linux sha256:55052d6fc8b2…error[E0283]: type annotations neededrust/rustc · compiler-diagnostic · outer cargo run証拠品質: complete · 環境バリアント: 1 · 初回記録: 2026-09-14 · 最終観測: 2026-09-14
-
観測済み PROJECT_COMPILE exit 101 ×1 1.0.47 os=linux sha256:7461bf46226d…error: could not compile `sample-serde-core` (bin <str>) due to 3 previous errorsrust/rustc · compiler-diagnostic · outer cargo run証拠品質: complete · 環境バリアント: 1 · 初回記録: 2026-09-14 · 最終観測: 2026-09-14
-
観測済み PROJECT_COMPILE exit 101 E0405 ×1 1.0.47 os=linux sha256:8a1088019b07…error[E0405]: cannot find trait `Serialize` in module `_serde` · error[E0405]: cannot find trait `Serializer` in module `_serde`rust/rustc · compiler-diagnostic · outer cargo check証拠品質: complete · 環境バリアント: 1 · 初回記録: 2026-09-14 · 最終観測: 2026-09-14
-
観測済み PROJECT_COMPILE exit 101 ×1 1.0.47 os=linux sha256:b21c095b1aba…error: could not compile `sample-serde-core` (bin <str>) due to 1 previous errorrust/rustc · compiler-diagnostic · outer cargo run証拠品質: complete · 環境バリアント: 1 · 初回記録: 2026-09-14 · 最終観測: 2026-09-14
-
観測済み PROJECT_COMPILE exit 101 ×1 1.0.47 os=linux sha256:df160d9ca814…error: could not compile `sample-serde-derive` (bin <str>) due to 7 previous errorsrust/rustc · compiler-diagnostic · outer cargo check証拠品質: complete · 環境バリアント: 1 · 初回記録: 2026-09-14 · 最終観測: 2026-09-14
-
観測済み PROJECT_COMPILE exit 101 E0599 ×1 1.0.47 os=linux sha256:f713b890152f…error[E0599]: no method named `into_deserializer` found for enum `std::option::Option<T>` in the current scope …rust/rustc · compiler-diagnostic · outer cargo run証拠品質: complete · 環境バリアント: 1 · 初回記録: 2026-09-14 · 最終観測: 2026-09-14
最も多く報告された 12 件を表示しています。この座標に記録された失敗クラスタは 18 件です。残りは単発の報告です。