记录cargoproc-macro21.0.107proc_macro2::Delimiter
更改条件
依赖健康度
此版本的依赖组合与失败观测
观测到问题 1 项 ·
正常 3 项
| 库 | 版本 | 健康状态 | 在那里测得 | 项目 |
|---|---|---|---|---|
| unicode-ident | 1.0.24 | PASS 所有观测均通过 | 契约通过 | 81 个项目日 |
| unicode-ident | 1.0.25 | PASS 所有观测均通过 | 观测到构建 | 15 个项目日 |
| unicode-ident | 1.0.26 | PASS 所有观测均通过 | 契约通过 | 110 个项目日 |
测量列说的是每个依赖自身版本的情况,而不是这一对的情况。解析器把两个版本放在一起,并不证明它们能协同工作。
近期失败聚类
-
已观测 PROJECT_COMPILE exit 101 ×1 1.0.107 os=linux sha256:0d5a8e2ccc86…error: could not compile `quote-test` (bin <str>) due to 1 previous error; 1 warning emittedrust/rustc · compiler-diagnostic · outer cargo run证据质量: complete · 环境变体: 1 · 首次记录: 2026-09-14 · 最近观测: 2026-09-14
-
已观测 PROJECT_COMPILE exit 101 E0432 ×1 1.0.107 os=linux sha256:4a6dd64b7a9b…error[E0432]: unresolved import `proc_macro2`rust/rustc · compiler-diagnostic · outer cargo test证据质量: complete · 环境变体: 1 · 首次记录: 2026-09-14 · 最近观测: 2026-09-14
-
已观测 PROJECT_COMPILE exit 101 E0277 ×1 1.0.107 os=linux sha256:ab12e03ad4b1…error[E0277]: the trait bound `i32: IdentFragment` is not satisfiedrust/rustc · compiler-diagnostic · outer cargo run证据质量: complete · 环境变体: 1 · 首次记录: 2026-09-14 · 最近观测: 2026-09-14
-
已观测 PROJECT_COMPILE exit 101 ×1 1.0.107 os=linux sha256:b53ce471a520…error: could not compile `test-quote` (lib) due to 1 previous error; 1 warning emittedrust/rustc · compiler-diagnostic · outer cargo test证据质量: complete · 环境变体: 1 · 首次记录: 2026-09-14 · 最近观测: 2026-09-14
-
已观测 PROJECT_TEST exit 101 ×1 1.0.107 os=linux sha256:cc325a11570b…error: test failed, to rerun pass `--lib` · running 6 tests · test tests::test_quote_basic_tokens ... ok …rust/test · test-runner-diagnostic · outer cargo test证据质量: complete · 环境变体: 1 · 首次记录: 2026-09-14 · 最近观测: 2026-09-14
-
已观测 PROJECT_COMPILE exit 101 E0433 ×1 1.0.107 os=linux sha256:4cea35867957…error[E0433]: cannot find `__private229` in `_serde` · error[E0433]: cannot find `Serializer` in `_serde` · error[E0433]: cannot find `ser` in `_serde`rust/rustc · compiler-diagnostic · outer cargo check证据质量: complete · 环境变体: 1 · 首次记录: 2026-09-14 · 最近观测: 2026-09-14
-
已观测 PROJECT_COMPILE exit 101 E0283 ×1 1.0.107 os=linux sha256:55052d6fc8b2…error[E0283]: type annotations neededrust/rustc · compiler-diagnostic · outer cargo run证据质量: complete · 环境变体: 1 · 首次记录: 2026-09-14 · 最近观测: 2026-09-14
-
已观测 PROJECT_COMPILE exit 101 ×1 1.0.107 os=linux sha256:7461bf46226d…error: could not compile `sample-serde-core` (bin <str>) due to 3 previous errorsrust/rustc · compiler-diagnostic · outer cargo run证据质量: complete · 环境变体: 1 · 首次记录: 2026-09-14 · 最近观测: 2026-09-14
-
已观测 PROJECT_COMPILE exit 101 E0405 ×1 1.0.107 os=linux sha256:8a1088019b07…error[E0405]: cannot find trait `Serialize` in module `_serde` · error[E0405]: cannot find trait `Serializer` in module `_serde`rust/rustc · compiler-diagnostic · outer cargo check证据质量: complete · 环境变体: 1 · 首次记录: 2026-09-14 · 最近观测: 2026-09-14
-
已观测 PROJECT_COMPILE exit 101 ×1 1.0.107 os=linux sha256:b21c095b1aba…error: could not compile `sample-serde-core` (bin <str>) due to 1 previous errorrust/rustc · compiler-diagnostic · outer cargo run证据质量: complete · 环境变体: 1 · 首次记录: 2026-09-14 · 最近观测: 2026-09-14
-
已观测 PROJECT_COMPILE exit 101 ×1 1.0.107 os=linux sha256:df160d9ca814…error: could not compile `sample-serde-derive` (bin <str>) due to 7 previous errorsrust/rustc · compiler-diagnostic · outer cargo check证据质量: complete · 环境变体: 1 · 首次记录: 2026-09-14 · 最近观测: 2026-09-14
-
已观测 PROJECT_COMPILE exit 101 E0599 ×1 1.0.107 os=linux sha256:f713b890152f…error[E0599]: no method named `into_deserializer` found for enum `std::option::Option<T>` in the current scope …rust/rustc · compiler-diagnostic · outer cargo run证据质量: complete · 环境变体: 1 · 首次记录: 2026-09-14 · 最近观测: 2026-09-14
显示报告最多的 12 个。此坐标记录的失败聚类共 18 个。其余为单次报告。