Registroscargoproc-macro21.0.107proc_macro2::Ident
Mudar as condições
Condições atuais
proc_macro2::Ident @1.0.107ubuntu glibc · x64 · cargo 1
1 de 1 passaram
Observado — builds reais de projetos reportaram desta coordenada.
ainda sem amostra nesta coordenada
- Observações de projetos
- 1 / 1
- Verificações de contrato
- nada nesta coordenada
- Peers independentes que reportaram
- 1
- Último registro
- 2026-09-14
Evidências que você pode abrir
Saúde das dependências
Combinações observadas e evidências de falha para esta versão
Problemas observados: 1 ·
Estáveis: 3
Primeira quebra observada
1.0.107
linux
1 FAIL
· stage: PROJECT_COMPILE
· fingerprint: sha256:0d5a8e2ccc8650cb6b5b15c919d5bb10b9f10329752931e4b03800585a6b0656
| Biblioteca | Versão | Saúde | Medido ali | Projetos |
|---|---|---|---|---|
| unicode-ident | 1.0.24 | PASS Todas as observações passaram | contrato aprovado | 81 dias-projeto |
| unicode-ident | 1.0.25 | PASS Todas as observações passaram | builds observados | 15 dias-projeto |
| unicode-ident | 1.0.26 | PASS Todas as observações passaram | contrato aprovado | 110 dias-projeto |
A coluna de medição é sobre a versão de cada dependência em si, não sobre o par. Um resolvedor ter colocado duas versões lado a lado não é prova de que funcionam juntas.
Clusters de falha recentes
-
observado PROJECT_COMPILE exit 101 ×1 1.0.107 os=linux sha256:0d5a8e2ccc86…error: could not compile `quote-test` (bin <str>) due to 1 previous error; 1 warning emittedrust/rustc · compiler-diagnostic · outer cargo runQualidade da evidência: complete · Variantes de ambiente: 1 · Primeiro registro: 2026-09-14 · Visto por último: 2026-09-14
-
observado PROJECT_COMPILE exit 101 E0432 ×1 1.0.107 os=linux sha256:4a6dd64b7a9b…error[E0432]: unresolved import `proc_macro2`rust/rustc · compiler-diagnostic · outer cargo testQualidade da evidência: complete · Variantes de ambiente: 1 · Primeiro registro: 2026-09-14 · Visto por último: 2026-09-14
-
observado PROJECT_COMPILE exit 101 E0277 ×1 1.0.107 os=linux sha256:ab12e03ad4b1…error[E0277]: the trait bound `i32: IdentFragment` is not satisfiedrust/rustc · compiler-diagnostic · outer cargo runQualidade da evidência: complete · Variantes de ambiente: 1 · Primeiro registro: 2026-09-14 · Visto por último: 2026-09-14
-
observado PROJECT_COMPILE exit 101 ×1 1.0.107 os=linux sha256:b53ce471a520…error: could not compile `test-quote` (lib) due to 1 previous error; 1 warning emittedrust/rustc · compiler-diagnostic · outer cargo testQualidade da evidência: complete · Variantes de ambiente: 1 · Primeiro registro: 2026-09-14 · Visto por último: 2026-09-14
-
observado PROJECT_TEST exit 101 ×1 1.0.107 os=linux sha256:cc325a11570b…error: test failed, to rerun pass `--lib` · running 6 tests · test tests::test_quote_basic_tokens ... ok …rust/test · test-runner-diagnostic · outer cargo testQualidade da evidência: complete · Variantes de ambiente: 1 · Primeiro registro: 2026-09-14 · Visto por último: 2026-09-14
-
observado PROJECT_COMPILE exit 101 E0433 ×1 1.0.107 os=linux sha256:4cea35867957…error[E0433]: cannot find `__private229` in `_serde` · error[E0433]: cannot find `Serializer` in `_serde` · error[E0433]: cannot find `ser` in `_serde`rust/rustc · compiler-diagnostic · outer cargo checkQualidade da evidência: complete · Variantes de ambiente: 1 · Primeiro registro: 2026-09-14 · Visto por último: 2026-09-14
-
observado PROJECT_COMPILE exit 101 E0283 ×1 1.0.107 os=linux sha256:55052d6fc8b2…error[E0283]: type annotations neededrust/rustc · compiler-diagnostic · outer cargo runQualidade da evidência: complete · Variantes de ambiente: 1 · Primeiro registro: 2026-09-14 · Visto por último: 2026-09-14
-
observado PROJECT_COMPILE exit 101 ×1 1.0.107 os=linux sha256:7461bf46226d…error: could not compile `sample-serde-core` (bin <str>) due to 3 previous errorsrust/rustc · compiler-diagnostic · outer cargo runQualidade da evidência: complete · Variantes de ambiente: 1 · Primeiro registro: 2026-09-14 · Visto por último: 2026-09-14
-
observado PROJECT_COMPILE exit 101 E0405 ×1 1.0.107 os=linux sha256:8a1088019b07…error[E0405]: cannot find trait `Serialize` in module `_serde` · error[E0405]: cannot find trait `Serializer` in module `_serde`rust/rustc · compiler-diagnostic · outer cargo checkQualidade da evidência: complete · Variantes de ambiente: 1 · Primeiro registro: 2026-09-14 · Visto por último: 2026-09-14
-
observado PROJECT_COMPILE exit 101 ×1 1.0.107 os=linux sha256:b21c095b1aba…error: could not compile `sample-serde-core` (bin <str>) due to 1 previous errorrust/rustc · compiler-diagnostic · outer cargo runQualidade da evidência: complete · Variantes de ambiente: 1 · Primeiro registro: 2026-09-14 · Visto por último: 2026-09-14
-
observado PROJECT_COMPILE exit 101 ×1 1.0.107 os=linux sha256:df160d9ca814…error: could not compile `sample-serde-derive` (bin <str>) due to 7 previous errorsrust/rustc · compiler-diagnostic · outer cargo checkQualidade da evidência: complete · Variantes de ambiente: 1 · Primeiro registro: 2026-09-14 · Visto por último: 2026-09-14
-
observado PROJECT_COMPILE exit 101 E0599 ×1 1.0.107 os=linux sha256:f713b890152f…error[E0599]: no method named `into_deserializer` found for enum `std::option::Option<T>` in the current scope …rust/rustc · compiler-diagnostic · outer cargo runQualidade da evidência: complete · Variantes de ambiente: 1 · Primeiro registro: 2026-09-14 · Visto por último: 2026-09-14
Mostrando os 12 mais relatados de 18 grupos de falhas registrados. O resto são relatos únicos.