Registroscargoproc-macro21.0.107
Cambiar las condiciones
Condiciones actuales
proc-macro2 @1.0.107linux · musl · x64 · rust 1 · cargo · rust
total del paquete, no una API
2 de 2 pasaron
Verificado: esta red ejecutó un contrato en esta coordenada.
hay una muestra aquí y nuestra ejecución en esta coordenada terminó limpia (2)
- Observaciones de proyectos
- 4 / 4
- Verificaciones de contrato
- 2 / 2
- Registros de uso
- 8
- Peers independientes que reportaron
- 2
- Último registro
- 2026-09-17
Salud de dependencias
Combinaciones observadas y evidencia de fallos para esta versión
Primer fallo observado
1.0.107
linux
1 FAIL
· stage: PROJECT_COMPILE
· fingerprint: sha256:0d5a8e2ccc8650cb6b5b15c919d5bb10b9f10329752931e4b03800585a6b0656
| Biblioteca | Versión | Estado | Medido allí | Proyectos |
|---|---|---|---|---|
| unicode-ident | 1.0.24 | PASS Todas las observaciones pasaron | contrato aprobado | 81 días-proyecto |
| unicode-ident | 1.0.25 | PASS Todas las observaciones pasaron | compilaciones observadas | 15 días-proyecto |
| unicode-ident | 1.0.26 | PASS Todas las observaciones pasaron | contrato aprobado | 110 días-proyecto |
La columna de medición se refiere a la versión de cada dependencia en sí, no al par. Que un resolutor haya colocado dos versiones juntas no prueba que funcionen juntas.
Clústeres de fallos recientes
-
observado PROJECT_COMPILE exit 101 ×1 1.0.107 os=linux sha256:0d5a8e2ccc86…error: could not compile `quote-test` (bin <str>) due to 1 previous error; 1 warning emittedrust/rustc · compiler-diagnostic · outer cargo runCalidad de evidencia: complete · Variantes de entorno: 1 · Primer registro: 2026-09-14 · Última observación: 2026-09-14
-
observado PROJECT_COMPILE exit 101 E0432 ×1 1.0.107 os=linux sha256:4a6dd64b7a9b…error[E0432]: unresolved import `proc_macro2`rust/rustc · compiler-diagnostic · outer cargo testCalidad de evidencia: complete · Variantes de entorno: 1 · Primer registro: 2026-09-14 · Última observación: 2026-09-14
-
observado PROJECT_COMPILE exit 101 E0277 ×1 1.0.107 os=linux sha256:ab12e03ad4b1…error[E0277]: the trait bound `i32: IdentFragment` is not satisfiedrust/rustc · compiler-diagnostic · outer cargo runCalidad de evidencia: complete · Variantes de entorno: 1 · Primer registro: 2026-09-14 · Última observación: 2026-09-14
-
observado PROJECT_COMPILE exit 101 ×1 1.0.107 os=linux sha256:b53ce471a520…error: could not compile `test-quote` (lib) due to 1 previous error; 1 warning emittedrust/rustc · compiler-diagnostic · outer cargo testCalidad de evidencia: complete · Variantes de entorno: 1 · Primer registro: 2026-09-14 · Última observación: 2026-09-14
-
observado PROJECT_TEST exit 101 ×1 1.0.107 os=linux sha256:cc325a11570b…error: test failed, to rerun pass `--lib` · running 6 tests · test tests::test_quote_basic_tokens ... ok …rust/test · test-runner-diagnostic · outer cargo testCalidad de evidencia: complete · Variantes de entorno: 1 · Primer registro: 2026-09-14 · Última observación: 2026-09-14
-
observado PROJECT_COMPILE exit 101 E0433 ×1 1.0.107 os=linux sha256:4cea35867957…error[E0433]: cannot find `__private229` in `_serde` · error[E0433]: cannot find `Serializer` in `_serde` · error[E0433]: cannot find `ser` in `_serde`rust/rustc · compiler-diagnostic · outer cargo checkCalidad de evidencia: complete · Variantes de entorno: 1 · Primer registro: 2026-09-14 · Última observación: 2026-09-14
-
observado PROJECT_COMPILE exit 101 E0283 ×1 1.0.107 os=linux sha256:55052d6fc8b2…error[E0283]: type annotations neededrust/rustc · compiler-diagnostic · outer cargo runCalidad de evidencia: complete · Variantes de entorno: 1 · Primer registro: 2026-09-14 · Última observación: 2026-09-14
-
observado PROJECT_COMPILE exit 101 ×1 1.0.107 os=linux sha256:7461bf46226d…error: could not compile `sample-serde-core` (bin <str>) due to 3 previous errorsrust/rustc · compiler-diagnostic · outer cargo runCalidad de evidencia: complete · Variantes de entorno: 1 · Primer registro: 2026-09-14 · Última observación: 2026-09-14
-
observado PROJECT_COMPILE exit 101 E0405 ×1 1.0.107 os=linux sha256:8a1088019b07…error[E0405]: cannot find trait `Serialize` in module `_serde` · error[E0405]: cannot find trait `Serializer` in module `_serde`rust/rustc · compiler-diagnostic · outer cargo checkCalidad de evidencia: complete · Variantes de entorno: 1 · Primer registro: 2026-09-14 · Última observación: 2026-09-14
-
observado PROJECT_COMPILE exit 101 ×1 1.0.107 os=linux sha256:b21c095b1aba…error: could not compile `sample-serde-core` (bin <str>) due to 1 previous errorrust/rustc · compiler-diagnostic · outer cargo runCalidad de evidencia: complete · Variantes de entorno: 1 · Primer registro: 2026-09-14 · Última observación: 2026-09-14
-
observado PROJECT_COMPILE exit 101 ×1 1.0.107 os=linux sha256:df160d9ca814…error: could not compile `sample-serde-derive` (bin <str>) due to 7 previous errorsrust/rustc · compiler-diagnostic · outer cargo checkCalidad de evidencia: complete · Variantes de entorno: 1 · Primer registro: 2026-09-14 · Última observación: 2026-09-14
-
observado PROJECT_COMPILE exit 101 E0599 ×1 1.0.107 os=linux sha256:f713b890152f…error[E0599]: no method named `into_deserializer` found for enum `std::option::Option<T>` in the current scope …rust/rustc · compiler-diagnostic · outer cargo runCalidad de evidencia: complete · Variantes de entorno: 1 · Primer registro: 2026-09-14 · Última observación: 2026-09-14
Se muestran los 12 más reportados de 18 grupos de fallos registrados. El resto son reportes únicos.