記録cargopin-project-lite0.2.17
条件を変更
現在の条件
pin-project-lite @0.2.17alpine musl · x64 · rust 1 · cargo · rust
API ではなくパッケージ全体の合計
9 回中 8 回が成功
検証 — このネットワークがこの座標でコントラクトを実行しました。
サンプルあり — この座標には成功した実行と失敗した実行の両方が記録されている (4)
- プロジェクト観測
- 6 / 7
- コントラクト検証
- 8 / 9
- 使用記録
- 5
- 独立した報告ピア
- 1
- fingerprint を収集した失敗
- 0 / 1
- クロス検証
- 2 つ以上の独立したピアで再現
- 最終記録
- 2026-09-08
開ける証拠
依存関係のヘルス
ある解決処理がこのリリースのツリーを読み、依存関係はありませんでした。欠落ではなく測定結果です。
最近の失敗クラスター
-
観測済み PROJECT_COMPILE exit 101 ×2 0.2.17 os=linux sha256:a67fd218023f…error: could not compile `test-hyper-util` (bin <str>) due to 1 previous errorrust/rustc · compiler-diagnostic · outer cargo run証拠品質: complete · 環境バリアント: 1 · 初回記録: 2026-09-19 · 最終観測: 2026-09-19
-
観測済み PROJECT_TEST 証拠の欠落 ×1 0.2.17 executionContext=rust · os=linux · runtime=rust@1証拠品質: legacy-evidence-incomplete · 環境バリアント: 1 · 初回記録: 2026-09-08 · 最終観測: 2026-09-08
-
観測済み PROJECT_COMPILE exit 101 ×1 0.2.17 os=linux sha256:1043b6df5638…error: could not compile `test-hyper-util` (bin <str>) due to 1 previous error; 1 warning emittedrust/rustc · compiler-diagnostic · outer cargo check証拠品質: complete · 環境バリアント: 1 · 初回記録: 2026-09-19 · 最終観測: 2026-09-19
-
観測済み PROJECT_COMPILE exit 101 E0603 ×1 0.2.17 os=linux sha256:5200eda42d99…error[E0603]: module `error` is privaterust/rustc · compiler-diagnostic · outer cargo run証拠品質: complete · 環境バリアント: 1 · 初回記録: 2026-09-19 · 最終観測: 2026-09-19
-
観測済み PROJECT_COMPILE exit 101 E0624 ×1 0.2.17 os=linux sha256:65fda95c6b71…error[E0624]: method `remaining` is privaterust/rustc · compiler-diagnostic · outer cargo run証拠品質: complete · 環境バリアント: 1 · 初回記録: 2026-09-19 · 最終観測: 2026-09-19
-
観測済み PROJECT_COMPILE exit 101 E0599 ×1 0.2.17 os=linux sha256:689d8da7053d…error[E0599]: no method named `http1_only` found for mutable reference `&mut hyper_util::client::legacy::Builder` in the current scoperust/rustc · compiler-diagnostic · outer cargo run証拠品質: complete · 環境バリアント: 1 · 初回記録: 2026-09-19 · 最終観測: 2026-09-19
-
観測済み PROJECT_COMPILE exit 101 E0433 ×1 0.2.17 os=linux sha256:addfa6ed2041…error[E0433]: cannot find module or crate `http` in this scoperust/rustc · compiler-diagnostic · outer cargo run証拠品質: complete · 環境バリアント: 1 · 初回記録: 2026-09-19 · 最終観測: 2026-09-19
-
観測済み PROJECT_COMPILE exit 101 ×1 0.2.17 os=linux sha256:b35018818384…error: could not compile `axum-core-check` (bin <str>) due to 3 previous errorsrust/rustc · compiler-diagnostic · outer cargo run証拠品質: complete · 環境バリアント: 1 · 初回記録: 2026-09-19 · 最終観測: 2026-09-19
-
観測済み PROJECT_COMPILE exit 101 E0433 ×1 0.2.17 os=linux sha256:b3ae21627e63…error[E0433]: cannot find module or crate `tokio` in this scoperust/rustc · compiler-diagnostic · outer cargo check証拠品質: complete · 環境バリアント: 1 · 初回記録: 2026-09-19 · 最終観測: 2026-09-19
-
観測済み PROJECT_COMPILE exit 101 ×1 0.2.17 os=linux sha256:c429d449c2dc…error: could not compile `axum-core-check` (bin <str>) due to 1 previous errorrust/rustc · compiler-diagnostic · outer cargo run証拠品質: complete · 環境バリアント: 1 · 初回記録: 2026-09-19 · 最終観測: 2026-09-19
-
観測済み PROJECT_COMPILE exit 101 E0432 ×1 0.2.17 os=linux sha256:cce7c6259bba…error[E0432]: unresolved imports `hyper_util::rt::WithHyperIo`, `hyper_util::rt::WithTokioIo`rust/rustc · compiler-diagnostic · outer cargo check証拠品質: complete · 環境バリアント: 1 · 初回記録: 2026-09-19 · 最終観測: 2026-09-19
-
観測済み PROJECT_COMPILE exit 101 E0624 ×1 0.2.17 os=linux sha256:d32d1a8dc0f3…error[E0624]: associated function `from_err` is privaterust/rustc · compiler-diagnostic · outer cargo run証拠品質: complete · 環境バリアント: 1 · 初回記録: 2026-09-19 · 最終観測: 2026-09-19
最も多く報告された 12 件を表示しています。この座標に記録された失敗クラスタは 14 件です。残りは単発の報告です。