Registroscargopin-project-lite0.2.17
Mudar as condições
Condições atuais
pin-project-lite @0.2.17alpine musl · x64 · rust 1 · cargo · rust
total do pacote, não uma API
8 de 9 passaram
Verificado — esta rede executou um contrato nesta coordenada.
há uma amostra aqui e esta coordenada registra ao mesmo tempo uma execução aprovada e uma reprovada (4)
- Observações de projetos
- 6 / 7
- Verificações de contrato
- 8 / 9
- Registros de uso
- 5
- Peers independentes que reportaram
- 1
- Falhas com impressão digital capturada
- 0 / 1
- Verificação cruzada
- reproduzido por dois ou mais peers independentes
- Último registro
- 2026-09-08
Evidências que você pode abrir
Saúde das dependências
Uma resolução leu a árvore desta versão e não encontrou dependências. Isso é uma medição, não uma medição ausente.
Clusters de falha recentes
-
observado PROJECT_COMPILE exit 101 ×2 0.2.17 os=linux sha256:a67fd218023f…error: could not compile `test-hyper-util` (bin <str>) due to 1 previous errorrust/rustc · compiler-diagnostic · outer cargo runQualidade da evidência: complete · Variantes de ambiente: 1 · Primeiro registro: 2026-09-19 · Visto por último: 2026-09-19
-
observado PROJECT_TEST Lacuna de evidência ×1 0.2.17 executionContext=rust · os=linux · runtime=rust@1Qualidade da evidência: legacy-evidence-incomplete · Variantes de ambiente: 1 · Primeiro registro: 2026-09-08 · Visto por último: 2026-09-08
-
observado PROJECT_COMPILE exit 101 ×1 0.2.17 os=linux sha256:1043b6df5638…error: could not compile `test-hyper-util` (bin <str>) due to 1 previous error; 1 warning emittedrust/rustc · compiler-diagnostic · outer cargo checkQualidade da evidência: complete · Variantes de ambiente: 1 · Primeiro registro: 2026-09-19 · Visto por último: 2026-09-19
-
observado PROJECT_COMPILE exit 101 E0603 ×1 0.2.17 os=linux sha256:5200eda42d99…error[E0603]: module `error` is privaterust/rustc · compiler-diagnostic · outer cargo runQualidade da evidência: complete · Variantes de ambiente: 1 · Primeiro registro: 2026-09-19 · Visto por último: 2026-09-19
-
observado PROJECT_COMPILE exit 101 E0624 ×1 0.2.17 os=linux sha256:65fda95c6b71…error[E0624]: method `remaining` is privaterust/rustc · compiler-diagnostic · outer cargo runQualidade da evidência: complete · Variantes de ambiente: 1 · Primeiro registro: 2026-09-19 · Visto por último: 2026-09-19
-
observado PROJECT_COMPILE exit 101 E0599 ×1 0.2.17 os=linux sha256:689d8da7053d…error[E0599]: no method named `http1_only` found for mutable reference `&mut hyper_util::client::legacy::Builder` in the current scoperust/rustc · compiler-diagnostic · outer cargo runQualidade da evidência: complete · Variantes de ambiente: 1 · Primeiro registro: 2026-09-19 · Visto por último: 2026-09-19
-
observado PROJECT_COMPILE exit 101 E0433 ×1 0.2.17 os=linux sha256:addfa6ed2041…error[E0433]: cannot find module or crate `http` in this scoperust/rustc · compiler-diagnostic · outer cargo runQualidade da evidência: complete · Variantes de ambiente: 1 · Primeiro registro: 2026-09-19 · Visto por último: 2026-09-19
-
observado PROJECT_COMPILE exit 101 ×1 0.2.17 os=linux sha256:b35018818384…error: could not compile `axum-core-check` (bin <str>) due to 3 previous errorsrust/rustc · compiler-diagnostic · outer cargo runQualidade da evidência: complete · Variantes de ambiente: 1 · Primeiro registro: 2026-09-19 · Visto por último: 2026-09-19
-
observado PROJECT_COMPILE exit 101 E0433 ×1 0.2.17 os=linux sha256:b3ae21627e63…error[E0433]: cannot find module or crate `tokio` in this scoperust/rustc · compiler-diagnostic · outer cargo checkQualidade da evidência: complete · Variantes de ambiente: 1 · Primeiro registro: 2026-09-19 · Visto por último: 2026-09-19
-
observado PROJECT_COMPILE exit 101 ×1 0.2.17 os=linux sha256:c429d449c2dc…error: could not compile `axum-core-check` (bin <str>) due to 1 previous errorrust/rustc · compiler-diagnostic · outer cargo runQualidade da evidência: complete · Variantes de ambiente: 1 · Primeiro registro: 2026-09-19 · Visto por último: 2026-09-19
-
observado PROJECT_COMPILE exit 101 E0432 ×1 0.2.17 os=linux sha256:cce7c6259bba…error[E0432]: unresolved imports `hyper_util::rt::WithHyperIo`, `hyper_util::rt::WithTokioIo`rust/rustc · compiler-diagnostic · outer cargo checkQualidade da evidência: complete · Variantes de ambiente: 1 · Primeiro registro: 2026-09-19 · Visto por último: 2026-09-19
-
observado PROJECT_COMPILE exit 101 E0624 ×1 0.2.17 os=linux sha256:d32d1a8dc0f3…error[E0624]: associated function `from_err` is privaterust/rustc · compiler-diagnostic · outer cargo runQualidade da evidência: complete · Variantes de ambiente: 1 · Primeiro registro: 2026-09-19 · Visto por último: 2026-09-19
Mostrando os 12 mais relatados de 14 grupos de falhas registrados. O resto são relatos únicos.