Recordscargopin-project-lite0.2.17tower::steer::Steer
Change the conditions
Current conditions
tower::steer::Steer @0.2.17alpine musl · x64 · rust 1 · cargo · rust
1 of 2 passed
Verified — this network ran a contract at this coordinate.
there is a sample here, and this coordinate records both a passing and a failing run of it (1)
- Project observations
- nothing at this coordinate
- Contract verifications
- 1 / 2
- Cross-checked
- reproduced by two or more independent peers
- Last recorded
- 2026-09-08
Evidence you can open
Dependency Health
A resolution read this release's tree and found no dependencies. That is a measurement, not a missing one.
Recent failure clusters
-
observed PROJECT_COMPILE exit 101 ×2 0.2.17 os=linux sha256:a67fd218023f…error: could not compile `test-hyper-util` (bin <str>) due to 1 previous errorrust/rustc · compiler-diagnostic · outer cargo runEvidence quality: complete · Environment variants: 1 · First recorded: 2026-09-19 · Last seen: 2026-09-19
-
observed PROJECT_TEST Evidence gap ×1 0.2.17 executionContext=rust · os=linux · runtime=rust@1Evidence quality: legacy-evidence-incomplete · Environment variants: 1 · First recorded: 2026-09-08 · Last seen: 2026-09-08
-
observed PROJECT_COMPILE exit 101 ×1 0.2.17 os=linux sha256:1043b6df5638…error: could not compile `test-hyper-util` (bin <str>) due to 1 previous error; 1 warning emittedrust/rustc · compiler-diagnostic · outer cargo checkEvidence quality: complete · Environment variants: 1 · First recorded: 2026-09-19 · Last seen: 2026-09-19
-
observed PROJECT_COMPILE exit 101 E0603 ×1 0.2.17 os=linux sha256:5200eda42d99…error[E0603]: module `error` is privaterust/rustc · compiler-diagnostic · outer cargo runEvidence quality: complete · Environment variants: 1 · First recorded: 2026-09-19 · Last seen: 2026-09-19
-
observed PROJECT_COMPILE exit 101 E0624 ×1 0.2.17 os=linux sha256:65fda95c6b71…error[E0624]: method `remaining` is privaterust/rustc · compiler-diagnostic · outer cargo runEvidence quality: complete · Environment variants: 1 · First recorded: 2026-09-19 · Last seen: 2026-09-19
-
observed PROJECT_COMPILE exit 101 E0599 ×1 0.2.17 os=linux sha256:689d8da7053d…error[E0599]: no method named `http1_only` found for mutable reference `&mut hyper_util::client::legacy::Builder` in the current scoperust/rustc · compiler-diagnostic · outer cargo runEvidence quality: complete · Environment variants: 1 · First recorded: 2026-09-19 · Last seen: 2026-09-19
-
observed PROJECT_COMPILE exit 101 E0433 ×1 0.2.17 os=linux sha256:addfa6ed2041…error[E0433]: cannot find module or crate `http` in this scoperust/rustc · compiler-diagnostic · outer cargo runEvidence quality: complete · Environment variants: 1 · First recorded: 2026-09-19 · Last seen: 2026-09-19
-
observed PROJECT_COMPILE exit 101 ×1 0.2.17 os=linux sha256:b35018818384…error: could not compile `axum-core-check` (bin <str>) due to 3 previous errorsrust/rustc · compiler-diagnostic · outer cargo runEvidence quality: complete · Environment variants: 1 · First recorded: 2026-09-19 · Last seen: 2026-09-19
-
observed PROJECT_COMPILE exit 101 E0433 ×1 0.2.17 os=linux sha256:b3ae21627e63…error[E0433]: cannot find module or crate `tokio` in this scoperust/rustc · compiler-diagnostic · outer cargo checkEvidence quality: complete · Environment variants: 1 · First recorded: 2026-09-19 · Last seen: 2026-09-19
-
observed PROJECT_COMPILE exit 101 ×1 0.2.17 os=linux sha256:c429d449c2dc…error: could not compile `axum-core-check` (bin <str>) due to 1 previous errorrust/rustc · compiler-diagnostic · outer cargo runEvidence quality: complete · Environment variants: 1 · First recorded: 2026-09-19 · Last seen: 2026-09-19
-
observed PROJECT_COMPILE exit 101 E0432 ×1 0.2.17 os=linux sha256:cce7c6259bba…error[E0432]: unresolved imports `hyper_util::rt::WithHyperIo`, `hyper_util::rt::WithTokioIo`rust/rustc · compiler-diagnostic · outer cargo checkEvidence quality: complete · Environment variants: 1 · First recorded: 2026-09-19 · Last seen: 2026-09-19
-
observed PROJECT_COMPILE exit 101 E0624 ×1 0.2.17 os=linux sha256:d32d1a8dc0f3…error[E0624]: associated function `from_err` is privaterust/rustc · compiler-diagnostic · outer cargo runEvidence quality: complete · Environment variants: 1 · First recorded: 2026-09-19 · Last seen: 2026-09-19
Showing the 12 most-reported of 14 recorded failure clusters. The rest are single reports.