기록cargopin-project-lite0.2.17pin_project_lite::pin_project!
조건 변경
현재 조건
pin_project_lite::pin_project! @0.2.17alpine musl · x64 · rust 1 · cargo · rust
2회 중 2회 통과
검증 — 이 네트워크가 이 좌표에서 컨트랙트를 직접 실행했습니다.
샘플 있음 — 이 좌표에서 우리가 실행했고 통과함 (1)
- 프로젝트 관측
- 1 / 1
- 컨트랙트 검증
- 2 / 2
- 독립 보고 peer
- 1
- 교차 검증
- 서로 다른 peer 2곳 이상에서 재현됨
- 마지막 기록
- 2026-09-08
열어 볼 수 있는 증거
의존성 건강도
어떤 해결 과정이 이 릴리스의 트리를 읽었고 의존성이 없었습니다. 빠진 것이 아니라 측정된 것입니다.
최근 실패 클러스터
-
관측됨 PROJECT_COMPILE exit 101 ×2 0.2.17 os=linux sha256:a67fd218023f…error: could not compile `test-hyper-util` (bin <str>) due to 1 previous errorrust/rustc · compiler-diagnostic · outer cargo run증거 품질: complete · 환경 변형: 1 · 최초 관측: 2026-09-19 · 마지막 관측: 2026-09-19
-
관측됨 PROJECT_TEST 증거 공백 ×1 0.2.17 executionContext=rust · os=linux · runtime=rust@1증거 품질: legacy-evidence-incomplete · 환경 변형: 1 · 최초 관측: 2026-09-08 · 마지막 관측: 2026-09-08
-
관측됨 PROJECT_COMPILE exit 101 ×1 0.2.17 os=linux sha256:1043b6df5638…error: could not compile `test-hyper-util` (bin <str>) due to 1 previous error; 1 warning emittedrust/rustc · compiler-diagnostic · outer cargo check증거 품질: complete · 환경 변형: 1 · 최초 관측: 2026-09-19 · 마지막 관측: 2026-09-19
-
관측됨 PROJECT_COMPILE exit 101 E0603 ×1 0.2.17 os=linux sha256:5200eda42d99…error[E0603]: module `error` is privaterust/rustc · compiler-diagnostic · outer cargo run증거 품질: complete · 환경 변형: 1 · 최초 관측: 2026-09-19 · 마지막 관측: 2026-09-19
-
관측됨 PROJECT_COMPILE exit 101 E0624 ×1 0.2.17 os=linux sha256:65fda95c6b71…error[E0624]: method `remaining` is privaterust/rustc · compiler-diagnostic · outer cargo run증거 품질: complete · 환경 변형: 1 · 최초 관측: 2026-09-19 · 마지막 관측: 2026-09-19
-
관측됨 PROJECT_COMPILE exit 101 E0599 ×1 0.2.17 os=linux sha256:689d8da7053d…error[E0599]: no method named `http1_only` found for mutable reference `&mut hyper_util::client::legacy::Builder` in the current scoperust/rustc · compiler-diagnostic · outer cargo run증거 품질: complete · 환경 변형: 1 · 최초 관측: 2026-09-19 · 마지막 관측: 2026-09-19
-
관측됨 PROJECT_COMPILE exit 101 E0433 ×1 0.2.17 os=linux sha256:addfa6ed2041…error[E0433]: cannot find module or crate `http` in this scoperust/rustc · compiler-diagnostic · outer cargo run증거 품질: complete · 환경 변형: 1 · 최초 관측: 2026-09-19 · 마지막 관측: 2026-09-19
-
관측됨 PROJECT_COMPILE exit 101 ×1 0.2.17 os=linux sha256:b35018818384…error: could not compile `axum-core-check` (bin <str>) due to 3 previous errorsrust/rustc · compiler-diagnostic · outer cargo run증거 품질: complete · 환경 변형: 1 · 최초 관측: 2026-09-19 · 마지막 관측: 2026-09-19
-
관측됨 PROJECT_COMPILE exit 101 E0433 ×1 0.2.17 os=linux sha256:b3ae21627e63…error[E0433]: cannot find module or crate `tokio` in this scoperust/rustc · compiler-diagnostic · outer cargo check증거 품질: complete · 환경 변형: 1 · 최초 관측: 2026-09-19 · 마지막 관측: 2026-09-19
-
관측됨 PROJECT_COMPILE exit 101 ×1 0.2.17 os=linux sha256:c429d449c2dc…error: could not compile `axum-core-check` (bin <str>) due to 1 previous errorrust/rustc · compiler-diagnostic · outer cargo run증거 품질: complete · 환경 변형: 1 · 최초 관측: 2026-09-19 · 마지막 관측: 2026-09-19
-
관측됨 PROJECT_COMPILE exit 101 E0432 ×1 0.2.17 os=linux sha256:cce7c6259bba…error[E0432]: unresolved imports `hyper_util::rt::WithHyperIo`, `hyper_util::rt::WithTokioIo`rust/rustc · compiler-diagnostic · outer cargo check증거 품질: complete · 환경 변형: 1 · 최초 관측: 2026-09-19 · 마지막 관측: 2026-09-19
-
관측됨 PROJECT_COMPILE exit 101 E0624 ×1 0.2.17 os=linux sha256:d32d1a8dc0f3…error[E0624]: associated function `from_err` is privaterust/rustc · compiler-diagnostic · outer cargo run증거 품질: complete · 환경 변형: 1 · 최초 관측: 2026-09-19 · 마지막 관측: 2026-09-19
가장 많이 보고된 12개를 보여줍니다. 이 좌표에 기록된 실패 클러스터는 14개입니다. 나머지는 단발 보고입니다.