Записиcargoonce_cell1.21.4once_cell::race::OnceBox::get_or_init
Изменить условия
Текущие условия
once_cell::race::OnceBox::get_or_init @1.21.4alpine musl · x64 · rust 1 · cargo · rust
3 из 3 прошли
Проверено — эта сеть выполнила контракт в этой координате.
образец есть — наш запуск в этой координате завершился чисто (2)
- Наблюдения в проектах
- 1 / 1
- Проверки контрактом
- 3 / 3
- Независимые сообщившие пиры
- 1
- Перекрёстная проверка
- воспроизведено двумя и более независимыми пирами
- Последняя запись
- 2026-09-08
Свидетельства, которые можно открыть
Здоровье зависимостей
Наблюдаемые комбинации и свидетельства сбоев для этого выпуска
Замечено проблем: 1 ·
Стабильно: 1
Первый обнаруженный сбой
1.21.4
linux
1 FAIL
· stage: PROJECT_COMPILE
· fingerprint: sha256:4488bf5be6d692fa78ea0019693bf0b6b07c192362ef53bc38d6b4e7e78e3d15
| Библиотека | Версия | Состояние | Измерено там | Проектов |
|---|---|---|---|---|
| parking_lot_core | 0.9.12 | PASS Все наблюдения прошли успешно | сборки наблюдались | 1 проектный день |
Столбец измерения относится к релизу самой зависимости, а не к паре. То, что резолвер поставил два релиза рядом, не доказывает, что они работают вместе.
Недавние кластеры сбоев
-
наблюдалось PROJECT_COMPILE exit 101 E0507 ×1 1.21.4 os=linux sha256:4488bf5be6d6…error[E0507]: cannot move out of static item `FIELD_SET`rust/rustc · compiler-diagnostic · outer cargo runКачество данных: complete · Варианты среды: 1 · Первая запись: 2026-09-16 · Последнее наблюдение: 2026-09-16
-
наблюдалось PROJECT_COMPILE exit 101 ×1 1.21.4 os=linux sha256:7641f360237b…error: could not compile `sample-tracing-core` (bin <str>) due to 1 previous errorrust/rustc · compiler-diagnostic · outer cargo runКачество данных: complete · Варианты среды: 1 · Первая запись: 2026-09-16 · Последнее наблюдение: 2026-09-16
-
наблюдалось UNKNOWN exit 101 ERROR Пробел в данных ×1 1.21.4 os=linux sha256:7c6fafa6a835…Compiling sample-tracing-core v1.0.0 (<path> · Finished `dev` profile [unoptimized + debuginfo] target(s) in 0.21s · Running `target/debug/contract` …cargo · unclassified-diagnostic · outer cargo run · gap stage-unknownКачество данных: complete · Варианты среды: 1 · Первая запись: 2026-09-16 · Последнее наблюдение: 2026-09-16Кандидат на диагностическую перепроверку
-
наблюдалось PROJECT_COMPILE exit 101 ×1 1.21.4 os=linux sha256:4d444e9e07b5…error: could not compile `test-wb` (bin <str>) due to 1 previous errorrust/rustc · compiler-diagnostic · outer cargo checkКачество данных: complete · Варианты среды: 1 · Первая запись: 2026-09-19 · Последнее наблюдение: 2026-09-19
-
наблюдалось PROJECT_COMPILE exit 101 E0599 ×1 1.21.4 os=linux sha256:689d8da7053d…error[E0599]: no method named `http1_only` found for mutable reference `&mut hyper_util::client::legacy::Builder` in the current scoperust/rustc · compiler-diagnostic · outer cargo runКачество данных: complete · Варианты среды: 1 · Первая запись: 2026-09-19 · Последнее наблюдение: 2026-09-19
-
наблюдалось PROJECT_COMPILE exit 101 E0432 ×1 1.21.4 os=linux sha256:81ff5a6ae827…error[E0432]: unresolved import `wasm_bindgen_macro`rust/rustc · compiler-diagnostic · outer cargo checkКачество данных: complete · Варианты среды: 1 · Первая запись: 2026-09-19 · Последнее наблюдение: 2026-09-19
-
наблюдалось PROJECT_COMPILE exit 101 E0433 ×1 1.21.4 os=linux sha256:8d7d824b0493…error[E0433]: cannot find module or crate `wasm_bindgen` in this scoperust/rustc · compiler-diagnostic · outer cargo checkКачество данных: complete · Варианты среды: 1 · Первая запись: 2026-09-19 · Последнее наблюдение: 2026-09-19
-
наблюдалось PROJECT_COMPILE exit 101 ×1 1.21.4 os=linux sha256:a67fd218023f…error: could not compile `test-hyper-util` (bin <str>) due to 1 previous errorrust/rustc · compiler-diagnostic · outer cargo runКачество данных: complete · Варианты среды: 1 · Первая запись: 2026-09-19 · Последнее наблюдение: 2026-09-19
-
наблюдалось PROJECT_COMPILE exit 101 ×1 1.21.4 os=linux sha256:d0b315730521…error: could not compile `test-macro` (bin <str>) due to 1 previous errorrust/rustc · compiler-diagnostic · outer cargo checkКачество данных: complete · Варианты среды: 1 · Первая запись: 2026-09-19 · Последнее наблюдение: 2026-09-19
-
наблюдалось UNKNOWN signal ABORTED Пробел в данных ×1 1.21.4 os=linux sha256:5650faa5dc98…Finished `dev` profile [unoptimized + debuginfo] target(s) in 0.02s · Running `target/debug/test-js-sys` …cargo · unclassified-diagnostic · outer cargo run · gap stage-unknownКачество данных: complete · Варианты среды: 1 · Первая запись: 2026-09-19 · Последнее наблюдение: 2026-09-19Кандидат на диагностическую перепроверку
-
наблюдалось UNKNOWN exit 101 Пробел в данных ×1 1.21.4 os=linux sha256:7714306cce9e…Compiling unicode-ident v1.0.26 · Compiling cfg-if v1.0.5 · Compiling once_cell v1.21.4 · Compiling proc-macro2 v1.0.107cargo · unclassified-diagnostic · outer cargo run · gap stage-unknownКачество данных: complete · Варианты среды: 1 · Первая запись: 2026-09-19 · Последнее наблюдение: 2026-09-19Кандидат на диагностическую перепроверку
-
наблюдалось UNKNOWN exit 101 Пробел в данных ×1 1.21.4 os=linux sha256:c6c5fb2b7e90…Compiling test_wb v0.1.0 (<path> · Finished `dev` profile [unoptimized + debuginfo] target(s) in 0.18s · Running `target/debug/test_wb` …cargo · unclassified-diagnostic · outer cargo run · gap stage-unknownКачество данных: complete · Варианты среды: 1 · Первая запись: 2026-09-19 · Последнее наблюдение: 2026-09-19Кандидат на диагностическую перепроверку
Показаны 12 наиболее часто сообщаемых из 18 записанных кластеров отказов. Остальные — единичные сообщения.