记录cargoonce_cell1.21.4once_cell::race::OnceBox::get_or_init
更改条件
依赖健康度
此版本的依赖组合与失败观测
观测到问题 1 项 ·
正常 1 项
测量列说的是每个依赖自身版本的情况,而不是这一对的情况。解析器把两个版本放在一起,并不证明它们能协同工作。
近期失败聚类
-
已观测 PROJECT_COMPILE exit 101 E0507 ×1 1.21.4 os=linux sha256:4488bf5be6d6…error[E0507]: cannot move out of static item `FIELD_SET`rust/rustc · compiler-diagnostic · outer cargo run证据质量: complete · 环境变体: 1 · 首次记录: 2026-09-16 · 最近观测: 2026-09-16
-
已观测 PROJECT_COMPILE exit 101 ×1 1.21.4 os=linux sha256:7641f360237b…error: could not compile `sample-tracing-core` (bin <str>) due to 1 previous errorrust/rustc · compiler-diagnostic · outer cargo run证据质量: complete · 环境变体: 1 · 首次记录: 2026-09-16 · 最近观测: 2026-09-16
-
已观测 UNKNOWN exit 101 ERROR 证据缺口 ×1 1.21.4 os=linux sha256:7c6fafa6a835…Compiling sample-tracing-core v1.0.0 (<path> · Finished `dev` profile [unoptimized + debuginfo] target(s) in 0.21s · Running `target/debug/contract` …cargo · unclassified-diagnostic · outer cargo run · gap stage-unknown证据质量: complete · 环境变体: 1 · 首次记录: 2026-09-16 · 最近观测: 2026-09-16诊断复验候选
-
已观测 PROJECT_COMPILE exit 101 ×1 1.21.4 os=linux sha256:4d444e9e07b5…error: could not compile `test-wb` (bin <str>) due to 1 previous errorrust/rustc · compiler-diagnostic · outer cargo check证据质量: complete · 环境变体: 1 · 首次记录: 2026-09-19 · 最近观测: 2026-09-19
-
已观测 PROJECT_COMPILE exit 101 E0599 ×1 1.21.4 os=linux sha256:689d8da7053d…error[E0599]: no method named `http1_only` found for mutable reference `&mut hyper_util::client::legacy::Builder` in the current scoperust/rustc · compiler-diagnostic · outer cargo run证据质量: complete · 环境变体: 1 · 首次记录: 2026-09-19 · 最近观测: 2026-09-19
-
已观测 PROJECT_COMPILE exit 101 E0432 ×1 1.21.4 os=linux sha256:81ff5a6ae827…error[E0432]: unresolved import `wasm_bindgen_macro`rust/rustc · compiler-diagnostic · outer cargo check证据质量: complete · 环境变体: 1 · 首次记录: 2026-09-19 · 最近观测: 2026-09-19
-
已观测 PROJECT_COMPILE exit 101 E0433 ×1 1.21.4 os=linux sha256:8d7d824b0493…error[E0433]: cannot find module or crate `wasm_bindgen` in this scoperust/rustc · compiler-diagnostic · outer cargo check证据质量: complete · 环境变体: 1 · 首次记录: 2026-09-19 · 最近观测: 2026-09-19
-
已观测 PROJECT_COMPILE exit 101 ×1 1.21.4 os=linux sha256:a67fd218023f…error: could not compile `test-hyper-util` (bin <str>) due to 1 previous errorrust/rustc · compiler-diagnostic · outer cargo run证据质量: complete · 环境变体: 1 · 首次记录: 2026-09-19 · 最近观测: 2026-09-19
-
已观测 PROJECT_COMPILE exit 101 ×1 1.21.4 os=linux sha256:d0b315730521…error: could not compile `test-macro` (bin <str>) due to 1 previous errorrust/rustc · compiler-diagnostic · outer cargo check证据质量: complete · 环境变体: 1 · 首次记录: 2026-09-19 · 最近观测: 2026-09-19
-
已观测 UNKNOWN signal ABORTED 证据缺口 ×1 1.21.4 os=linux sha256:5650faa5dc98…Finished `dev` profile [unoptimized + debuginfo] target(s) in 0.02s · Running `target/debug/test-js-sys` …cargo · unclassified-diagnostic · outer cargo run · gap stage-unknown证据质量: complete · 环境变体: 1 · 首次记录: 2026-09-19 · 最近观测: 2026-09-19诊断复验候选
-
已观测 UNKNOWN exit 101 证据缺口 ×1 1.21.4 os=linux sha256:7714306cce9e…Compiling unicode-ident v1.0.26 · Compiling cfg-if v1.0.5 · Compiling once_cell v1.21.4 · Compiling proc-macro2 v1.0.107cargo · unclassified-diagnostic · outer cargo run · gap stage-unknown证据质量: complete · 环境变体: 1 · 首次记录: 2026-09-19 · 最近观测: 2026-09-19诊断复验候选
-
已观测 UNKNOWN exit 101 证据缺口 ×1 1.21.4 os=linux sha256:c6c5fb2b7e90…Compiling test_wb v0.1.0 (<path> · Finished `dev` profile [unoptimized + debuginfo] target(s) in 0.18s · Running `target/debug/test_wb` …cargo · unclassified-diagnostic · outer cargo run · gap stage-unknown证据质量: complete · 环境变体: 1 · 首次记录: 2026-09-19 · 最近观测: 2026-09-19诊断复验候选
显示报告最多的 12 个。此坐标记录的失败聚类共 18 个。其余为单次报告。