Recordscargolibc0.2.191
Change the conditions
Current conditions
libc @0.2.191ubuntu glibc · x64 · cargo 1
package-level total, not an API
15 of 23 passed
Observed — real project builds reported from this coordinate.
no sample at this coordinate yet
- Project observations
- 15 / 23
- Contract verifications
- nothing at this coordinate
- Independent reporting peers
- 1
- Last recorded
- 2026-10-20
Evidence you can open
Dependency Health
A resolution read this release's tree and found no dependencies. That is a measurement, not a missing one.
Recent failure clusters
-
observed PROJECT_TEST exit 101 ×2 0.2.191 os=linux sha256:4f232600c5a8…error: test failed, to rerun pass `--test contract` · running 0 tests …rust/test · test-runner-diagnostic · outer cargo testEvidence quality: complete · Environment variants: 1 · First recorded: 2026-10-20 · Last seen: 2026-10-20
-
observed PROJECT_COMPILE exit 101 ×1 0.2.191 os=linux sha256:aaf1990e27c5…error: could not compile `sample-addr2line` (test <str>) due to 2 previous errors …rust/rustc · compiler-diagnostic · outer cargo testEvidence quality: complete · Environment variants: 1 · First recorded: 2026-10-19 · Last seen: 2026-10-19
-
observed PROJECT_COMPILE exit 101 E0432 ×1 0.2.191 os=linux sha256:ac7324fdd333…error[E0432]: unresolved import `addr2line::object`rust/rustc · compiler-diagnostic · outer cargo testEvidence quality: complete · Environment variants: 1 · First recorded: 2026-10-19 · Last seen: 2026-10-19
-
observed PROJECT_COMPILE exit 101 E0599 ×1 0.2.191 os=linux sha256:ff95f88fed26…error[E0599]: no associated function or constant named `new` found for struct `addr2line::Context<R>` in the current scoperust/rustc · compiler-diagnostic · outer cargo testEvidence quality: complete · Environment variants: 1 · First recorded: 2026-10-19 · Last seen: 2026-10-19
-
observed PROJECT_TEST exit 101 E0432 ×1 0.2.191 os=linux sha256:c4faf3580ad8…34 | let ctx = Context::new(&obj_file).expect(<str>); · | ^^^ associated function or constant not found in `addr2line::Context<_>` · | …rust/test · test-runner-diagnostic · outer cargo testEvidence quality: complete · Environment variants: 1 · First recorded: 2026-10-19 · Last seen: 2026-10-19
-
observed PROJECT_COMPILE exit 101 E0308 ×1 0.2.191 os=linux sha256:0479254218ac…error[E0308]: mismatched typesrust/rustc · compiler-diagnostic · outer cargo runEvidence quality: complete · Environment variants: 1 · First recorded: 2026-10-19 · Last seen: 2026-10-19
-
observed PROJECT_COMPILE exit 101 ×1 0.2.191 os=linux sha256:4c786cbbce8a…error: could not compile `sample` (bin <str>) due to 1 previous errorrust/rustc · compiler-diagnostic · outer cargo runEvidence quality: complete · Environment variants: 1 · First recorded: 2026-10-19 · Last seen: 2026-10-19