记录cargoicu_time2.3.0
更改条件
依赖健康度
此版本的依赖组合与失败观测
观测到问题 1 项 ·
正常 11 项
| 库 | 版本 | 健康状态 | 在那里测得 | 项目 |
|---|---|---|---|---|
| calendrical_calculations | 0.2.4 | PASS 所有观测均通过 | 观测到构建 | 4 个项目日 |
| displaydoc | 0.2.7 | PASS 所有观测均通过 | 契约通过 | 4 个项目日 |
| icu_calendar | 2.3.0 | PASS 所有观测均通过 | 观测到构建 | 4 个项目日 |
| icu_locale_core | 2.3.0 | PASS 所有观测均通过 | 契约通过 | 4 个项目日 |
| icu_provider | 2.3.0 | PASS 所有观测均通过 | 观测到构建 | 1 个项目日 |
| icu_provider | 2.3.1 | PASS 所有观测均通过 | 契约通过 | 3 个项目日 |
| icu_time_data | 2.3.0 | PASS 所有观测均通过 | 观测到构建 | 3 个项目日 |
| ixdtf | 0.6.6 | PASS 所有观测均通过 | 观测到构建 | 3 个项目日 |
| serde | 1.0.229 | PASS 所有观测均通过 | 契约通过 | 4 个项目日 |
| zerotrie | 0.2.5 | PASS 所有观测均通过 | 契约通过 | 4 个项目日 |
| zerovec | 0.11.8 | PASS 所有观测均通过 | 契约通过 | 4 个项目日 |
测量列说的是每个依赖自身版本的情况,而不是这一对的情况。解析器把两个版本放在一起,并不证明它们能协同工作。
近期失败聚类
-
已观测 PROJECT_COMPILE exit 101 ×5 2.3.0 os=linux sha256:113664d7d918…error: could not compile `probe_icu` (bin <str>) due to 1 previous errorrust/rustc · compiler-diagnostic · outer cargo run证据质量: complete · 环境变体: 1 · 首次记录: 2026-09-20 · 最近观测: 2026-09-20
-
已观测 PROJECT_COMPILE exit 101 E0599 ×1 2.3.0 os=linux sha256:0fbd73add053…error[E0599]: no method named `is_empty` found for struct `Char16Trie<'data>` in the current scoperust/rustc · compiler-diagnostic · outer cargo run证据质量: complete · 环境变体: 1 · 首次记录: 2026-09-20 · 最近观测: 2026-09-20
-
已观测 PROJECT_COMPILE exit 101 E0599 ×1 2.3.0 os=linux sha256:16d23d1801b1…error[E0599]: no method named `normalize` found for struct `ComposingNormalizer` in the current scoperust/rustc · compiler-diagnostic · outer cargo run证据质量: complete · 环境变体: 1 · 首次记录: 2026-09-20 · 最近观测: 2026-09-20
-
已观测 PROJECT_COMPILE exit 101 E0599 ×1 2.3.0 os=linux sha256:267702ebcc26…error[E0599]: no associated function or constant named `new_nfc_unstable` found for struct `ComposingNormalizer` in the current scoperust/rustc · compiler-diagnostic · outer cargo run证据质量: complete · 环境变体: 1 · 首次记录: 2026-09-20 · 最近观测: 2026-09-20
-
已观测 PROJECT_COMPILE exit 101 E0609 ×1 2.3.0 os=linux sha256:463107715912…error[E0609]: no field `SINGLETON_NORMALIZER_NFC_V1` on type `MyProvider`rust/rustc · compiler-diagnostic · outer cargo run证据质量: complete · 环境变体: 1 · 首次记录: 2026-09-20 · 最近观测: 2026-09-20
-
已观测 PROJECT_COMPILE exit 101 E0599 ×1 2.3.0 os=linux sha256:f752258b26cc…error[E0599]: no method named `as_bytes` found for reference `&Char16Trie<'_>` in the current scoperust/rustc · compiler-diagnostic · outer cargo run证据质量: complete · 环境变体: 1 · 首次记录: 2026-09-20 · 最近观测: 2026-09-20