Registroscargoicu_pattern0.5.0
Mudar as condições
Condições atuais
icu_pattern @0.5.0linux · musl · x64 · rust 1 · cargo · rust
total do pacote, não uma API
Registrado como presente em projetos. Nada foi executado nesta coordenada.
Observado — builds reais de projetos reportaram desta coordenada.
ainda sem amostra nesta coordenada
- Observações de projetos
- nada nesta coordenada
- Verificações de contrato
- nada nesta coordenada
- Registros de uso
- 1
- Peers independentes que reportaram
- 1
- Último registro
- 2026-10-09
Evidências que você pode abrir
Saúde das dependências
Combinações observadas e evidências de falha para esta versão
Problemas observados: 1 ·
Estáveis: 6
Primeira quebra observada
0.5.0
linux
5 FAIL
· stage: PROJECT_COMPILE
· fingerprint: sha256:113664d7d9181e86107a4fb50e44d53895730e410223b707c0b72d659b247aef
| Biblioteca | Versão | Saúde | Medido ali | Projetos |
|---|---|---|---|---|
| displaydoc | 0.2.7 | PASS Todas as observações passaram | contrato aprovado | 4 dias-projeto |
| either | 1.18.0 | PASS Todas as observações passaram | builds observados | 4 dias-projeto |
| serde | 1.0.229 | PASS Todas as observações passaram | contrato aprovado | 4 dias-projeto |
| writeable | 0.6.4 | PASS Todas as observações passaram | contrato aprovado | 4 dias-projeto |
| yoke | 0.8.3 | PASS Todas as observações passaram | contrato aprovado | 3 dias-projeto |
| zerovec | 0.11.8 | PASS Todas as observações passaram | contrato aprovado | 4 dias-projeto |
A coluna de medição é sobre a versão de cada dependência em si, não sobre o par. Um resolvedor ter colocado duas versões lado a lado não é prova de que funcionam juntas.
Clusters de falha recentes
-
observado PROJECT_COMPILE exit 101 ×5 0.5.0 os=linux sha256:113664d7d918…error: could not compile `probe_icu` (bin <str>) due to 1 previous errorrust/rustc · compiler-diagnostic · outer cargo runQualidade da evidência: complete · Variantes de ambiente: 1 · Primeiro registro: 2026-09-20 · Visto por último: 2026-09-20
-
observado PROJECT_COMPILE exit 101 E0599 ×1 0.5.0 os=linux sha256:0fbd73add053…error[E0599]: no method named `is_empty` found for struct `Char16Trie<'data>` in the current scoperust/rustc · compiler-diagnostic · outer cargo runQualidade da evidência: complete · Variantes de ambiente: 1 · Primeiro registro: 2026-09-20 · Visto por último: 2026-09-20
-
observado PROJECT_COMPILE exit 101 E0599 ×1 0.5.0 os=linux sha256:16d23d1801b1…error[E0599]: no method named `normalize` found for struct `ComposingNormalizer` in the current scoperust/rustc · compiler-diagnostic · outer cargo runQualidade da evidência: complete · Variantes de ambiente: 1 · Primeiro registro: 2026-09-20 · Visto por último: 2026-09-20
-
observado PROJECT_COMPILE exit 101 E0599 ×1 0.5.0 os=linux sha256:267702ebcc26…error[E0599]: no associated function or constant named `new_nfc_unstable` found for struct `ComposingNormalizer` in the current scoperust/rustc · compiler-diagnostic · outer cargo runQualidade da evidência: complete · Variantes de ambiente: 1 · Primeiro registro: 2026-09-20 · Visto por último: 2026-09-20
-
observado PROJECT_COMPILE exit 101 E0609 ×1 0.5.0 os=linux sha256:463107715912…error[E0609]: no field `SINGLETON_NORMALIZER_NFC_V1` on type `MyProvider`rust/rustc · compiler-diagnostic · outer cargo runQualidade da evidência: complete · Variantes de ambiente: 1 · Primeiro registro: 2026-09-20 · Visto por último: 2026-09-20
-
observado PROJECT_COMPILE exit 101 E0599 ×1 0.5.0 os=linux sha256:f752258b26cc…error[E0599]: no method named `as_bytes` found for reference `&Char16Trie<'_>` in the current scoperust/rustc · compiler-diagnostic · outer cargo runQualidade da evidência: complete · Variantes de ambiente: 1 · Primeiro registro: 2026-09-20 · Visto por último: 2026-09-20