记录cargoicu_experimental0.6.0
更改条件
依赖健康度
此版本的依赖组合与失败观测
观测到问题 1 项 ·
正常 27 项
| 库 | 版本 | 健康状态 | 在那里测得 | 项目 |
|---|---|---|---|---|
| displaydoc | 0.2.7 | PASS 所有观测均通过 | 契约通过 | 4 个项目日 |
| either | 1.18.0 | PASS 所有观测均通过 | 观测到构建 | 4 个项目日 |
| fixed_decimal | 0.7.2 | PASS 所有观测均通过 | 观测到构建 | 4 个项目日 |
| icu_casemap | 2.3.0 | PASS 所有观测均通过 | 观测到构建 | 4 个项目日 |
| icu_collections | 2.3.0 | PASS 所有观测均通过 | 契约通过 | 4 个项目日 |
| icu_decimal | 2.3.0 | PASS 所有观测均通过 | 观测到构建 | 4 个项目日 |
| icu_experimental_data | 0.6.0 | PASS 所有观测均通过 | 观测到构建 | 2 个项目日 |
| icu_list | 2.3.0 | PASS 所有观测均通过 | 观测到构建 | 4 个项目日 |
| icu_locale | 2.3.1 | PASS 所有观测均通过 | 观测到构建 | 4 个项目日 |
| icu_locale_core | 2.3.0 | PASS 所有观测均通过 | 契约通过 | 4 个项目日 |
| icu_locale_fallback | 2.3.0 | PASS 所有观测均通过 | 观测到构建 | 2 个项目日 |
| icu_normalizer | 2.3.0 | PASS 所有观测均通过 | 观测到构建 | 4 个项目日 |
| icu_pattern | 0.5.0 | PASS 所有观测均通过 | 观测到构建 | 4 个项目日 |
| icu_plurals | 2.3.0 | PASS 所有观测均通过 | 观测到构建 | 4 个项目日 |
| icu_properties | 2.3.0 | PASS 所有观测均通过 | 契约通过 | 4 个项目日 |
| icu_provider | 2.3.0 | PASS 所有观测均通过 | 观测到构建 | 1 个项目日 |
| icu_provider | 2.3.1 | PASS 所有观测均通过 | 契约通过 | 3 个项目日 |
| litemap | 0.8.3 | PASS 所有观测均通过 | 契约通过 | 4 个项目日 |
| num-bigint | 0.4.8 | PASS 所有观测均通过 | 观测到构建 | 2 个项目日 |
| num-rational | 0.4.2 | PASS 所有观测均通过 | 观测到构建 | 2 个项目日 |
| num-traits | 0.2.19 | PASS 所有观测均通过 | 契约通过 | 2 个项目日 |
| potential_utf | 0.1.6 | PASS 所有观测均通过 | 契约通过 | 2 个项目日 |
| smallvec | 1.16.1 | PASS 所有观测均通过 | 契约通过 | 4 个项目日 |
| tinystr | 0.8.4 | PASS 所有观测均通过 | 契约通过 | 4 个项目日 |
| writeable | 0.6.4 | PASS 所有观测均通过 | 契约通过 | 4 个项目日 |
| zerotrie | 0.2.5 | PASS 所有观测均通过 | 契约通过 | 4 个项目日 |
| zerovec | 0.11.8 | PASS 所有观测均通过 | 契约通过 | 4 个项目日 |
测量列说的是每个依赖自身版本的情况,而不是这一对的情况。解析器把两个版本放在一起,并不证明它们能协同工作。
近期失败聚类
-
已观测 PROJECT_COMPILE exit 101 ×5 0.6.0 os=linux sha256:113664d7d918…error: could not compile `probe_icu` (bin <str>) due to 1 previous errorrust/rustc · compiler-diagnostic · outer cargo run证据质量: complete · 环境变体: 1 · 首次记录: 2026-09-20 · 最近观测: 2026-09-20
-
已观测 PROJECT_COMPILE exit 101 E0599 ×1 0.6.0 os=linux sha256:0fbd73add053…error[E0599]: no method named `is_empty` found for struct `Char16Trie<'data>` in the current scoperust/rustc · compiler-diagnostic · outer cargo run证据质量: complete · 环境变体: 1 · 首次记录: 2026-09-20 · 最近观测: 2026-09-20
-
已观测 PROJECT_COMPILE exit 101 E0599 ×1 0.6.0 os=linux sha256:16d23d1801b1…error[E0599]: no method named `normalize` found for struct `ComposingNormalizer` in the current scoperust/rustc · compiler-diagnostic · outer cargo run证据质量: complete · 环境变体: 1 · 首次记录: 2026-09-20 · 最近观测: 2026-09-20
-
已观测 PROJECT_COMPILE exit 101 E0599 ×1 0.6.0 os=linux sha256:267702ebcc26…error[E0599]: no associated function or constant named `new_nfc_unstable` found for struct `ComposingNormalizer` in the current scoperust/rustc · compiler-diagnostic · outer cargo run证据质量: complete · 环境变体: 1 · 首次记录: 2026-09-20 · 最近观测: 2026-09-20
-
已观测 PROJECT_COMPILE exit 101 E0609 ×1 0.6.0 os=linux sha256:463107715912…error[E0609]: no field `SINGLETON_NORMALIZER_NFC_V1` on type `MyProvider`rust/rustc · compiler-diagnostic · outer cargo run证据质量: complete · 环境变体: 1 · 首次记录: 2026-09-20 · 最近观测: 2026-09-20
-
已观测 PROJECT_COMPILE exit 101 E0599 ×1 0.6.0 os=linux sha256:f752258b26cc…error[E0599]: no method named `as_bytes` found for reference `&Char16Trie<'_>` in the current scoperust/rustc · compiler-diagnostic · outer cargo run证据质量: complete · 环境变体: 1 · 首次记录: 2026-09-20 · 最近观测: 2026-09-20