Recordscargoicu_calendar2.3.0
Change the conditions
Current conditions
icu_calendar @2.3.0linux · musl · x64 · rust 1 · cargo · rust
package-level total, not an API
Recorded as present in projects. Nothing was run at this coordinate.
Observed — real project builds reported from this coordinate.
no sample at this coordinate yet
- Project observations
- nothing at this coordinate
- Contract verifications
- nothing at this coordinate
- Usage records
- 1
- Independent reporting peers
- 1
- Last recorded
- 2026-10-09
Evidence you can open
Dependency Health
Observed combinations and failure evidence for this release
Observed problems 1 ·
Steady 11
First observed break
2.3.0
linux
5 FAIL
· stage: PROJECT_COMPILE
· fingerprint: sha256:113664d7d9181e86107a4fb50e44d53895730e410223b707c0b72d659b247aef
| Library | Version | Health | Measured there | Projects |
|---|---|---|---|---|
| calendrical_calculations | 0.2.4 | PASS All observations passed | builds observed | 4 project-days |
| displaydoc | 0.2.7 | PASS All observations passed | contract passed | 4 project-days |
| icu_calendar_data | 2.3.0 | PASS All observations passed | builds observed | 2 project-days |
| icu_locale_core | 2.3.0 | PASS All observations passed | contract passed | 4 project-days |
| icu_locale_fallback | 2.3.0 | PASS All observations passed | builds observed | 2 project-days |
| icu_provider | 2.3.0 | PASS All observations passed | builds observed | 1 project-day |
| icu_provider | 2.3.1 | PASS All observations passed | contract passed | 3 project-days |
| ixdtf | 0.6.6 | PASS All observations passed | builds observed | 2 project-days |
| serde | 1.0.229 | PASS All observations passed | contract passed | 4 project-days |
| tinystr | 0.8.4 | PASS All observations passed | contract passed | 4 project-days |
| zerovec | 0.11.8 | PASS All observations passed | contract passed | 4 project-days |
The measured column is about each dependency's own release, not about the pair. A resolver placing two releases side by side is not evidence that they work together.
Recent failure clusters
-
observed PROJECT_COMPILE exit 101 ×5 2.3.0 os=linux sha256:113664d7d918…error: could not compile `probe_icu` (bin <str>) due to 1 previous errorrust/rustc · compiler-diagnostic · outer cargo runEvidence quality: complete · Environment variants: 1 · First recorded: 2026-09-20 · Last seen: 2026-09-20
-
observed PROJECT_COMPILE exit 101 E0599 ×1 2.3.0 os=linux sha256:0fbd73add053…error[E0599]: no method named `is_empty` found for struct `Char16Trie<'data>` in the current scoperust/rustc · compiler-diagnostic · outer cargo runEvidence quality: complete · Environment variants: 1 · First recorded: 2026-09-20 · Last seen: 2026-09-20
-
observed PROJECT_COMPILE exit 101 E0599 ×1 2.3.0 os=linux sha256:16d23d1801b1…error[E0599]: no method named `normalize` found for struct `ComposingNormalizer` in the current scoperust/rustc · compiler-diagnostic · outer cargo runEvidence quality: complete · Environment variants: 1 · First recorded: 2026-09-20 · Last seen: 2026-09-20
-
observed PROJECT_COMPILE exit 101 E0599 ×1 2.3.0 os=linux sha256:267702ebcc26…error[E0599]: no associated function or constant named `new_nfc_unstable` found for struct `ComposingNormalizer` in the current scoperust/rustc · compiler-diagnostic · outer cargo runEvidence quality: complete · Environment variants: 1 · First recorded: 2026-09-20 · Last seen: 2026-09-20
-
observed PROJECT_COMPILE exit 101 E0609 ×1 2.3.0 os=linux sha256:463107715912…error[E0609]: no field `SINGLETON_NORMALIZER_NFC_V1` on type `MyProvider`rust/rustc · compiler-diagnostic · outer cargo runEvidence quality: complete · Environment variants: 1 · First recorded: 2026-09-20 · Last seen: 2026-09-20
-
observed PROJECT_COMPILE exit 101 E0599 ×1 2.3.0 os=linux sha256:f752258b26cc…error[E0599]: no method named `as_bytes` found for reference `&Char16Trie<'_>` in the current scoperust/rustc · compiler-diagnostic · outer cargo runEvidence quality: complete · Environment variants: 1 · First recorded: 2026-09-20 · Last seen: 2026-09-20