기록cargoicu2.3.0icu::normalizer::ComposingNormalizer
조건 변경
현재 조건
icu::normalizer::ComposingNormalizer @2.3.0ubuntu glibc · x64 · cargo 1
5회 중 1회 통과
관측 — 실제 프로젝트 빌드가 이 좌표에서 보고되었습니다.
이 좌표에는 아직 샘플이 없음
- 프로젝트 관측
- 1 / 5
- 컨트랙트 검증
- 이 좌표에는 없음
- 독립 보고 peer
- 1
- 마지막 기록
- 2026-09-20
열어 볼 수 있는 증거
의존성 건강도
이 릴리스의 의존성 조합과 실패 관측 결과
관측된 문제 1건 ·
정상 17건
| 라이브러리 | 버전 | 건강도 | 그 좌표에서 측정된 것 | 프로젝트 |
|---|---|---|---|---|
| icu_calendar | 2.3.0 | PASS 모든 관측 정상 통과 | 빌드 관측됨 | 프로젝트-일 4개 |
| icu_casemap | 2.3.0 | PASS 모든 관측 정상 통과 | 빌드 관측됨 | 프로젝트-일 4개 |
| icu_collator | 2.3.1 | PASS 모든 관측 정상 통과 | 빌드 관측됨 | 프로젝트-일 4개 |
| icu_collections | 2.3.0 | PASS 모든 관측 정상 통과 | 컨트랙트 통과 | 프로젝트-일 4개 |
| icu_datetime | 2.3.0 | PASS 모든 관측 정상 통과 | 빌드 관측됨 | 프로젝트-일 4개 |
| icu_decimal | 2.3.0 | PASS 모든 관측 정상 통과 | 빌드 관측됨 | 프로젝트-일 4개 |
| icu_experimental | 0.6.0 | PASS 모든 관측 정상 통과 | 빌드 관측됨 | 프로젝트-일 4개 |
| icu_list | 2.3.0 | PASS 모든 관측 정상 통과 | 빌드 관측됨 | 프로젝트-일 4개 |
| icu_locale | 2.3.1 | PASS 모든 관측 정상 통과 | 빌드 관측됨 | 프로젝트-일 4개 |
| icu_normalizer | 2.3.0 | PASS 모든 관측 정상 통과 | 빌드 관측됨 | 프로젝트-일 4개 |
| icu_pattern | 0.5.0 | PASS 모든 관측 정상 통과 | 빌드 관측됨 | 프로젝트-일 4개 |
| icu_plurals | 2.3.0 | PASS 모든 관측 정상 통과 | 빌드 관측됨 | 프로젝트-일 4개 |
| icu_properties | 2.3.0 | PASS 모든 관측 정상 통과 | 컨트랙트 통과 | 프로젝트-일 4개 |
| icu_provider | 2.3.0 | PASS 모든 관측 정상 통과 | 빌드 관측됨 | 프로젝트-일 1개 |
| icu_provider | 2.3.1 | PASS 모든 관측 정상 통과 | 컨트랙트 통과 | 프로젝트-일 3개 |
| icu_segmenter | 2.3.0 | PASS 모든 관측 정상 통과 | 빌드 관측됨 | 프로젝트-일 3개 |
| icu_time | 2.3.0 | PASS 모든 관측 정상 통과 | 빌드 관측됨 | 프로젝트-일 2개 |
측정 열은 각 의존성 자신의 릴리스에 대한 것이지 두 릴리스의 조합에 대한 것이 아닙니다. 리졸버가 둘을 나란히 놓았다는 사실은 함께 동작한다는 증거가 아닙니다.
최근 실패 클러스터
-
관측됨 PROJECT_COMPILE exit 101 ×5 2.3.0 os=linux icu::normalizer::ComposingNormalizer sha256:113664d7d918…error: could not compile `probe_icu` (bin <str>) due to 1 previous errorrust/rustc · compiler-diagnostic · outer cargo run증거 품질: complete · 환경 변형: 1 · 최초 관측: 2026-09-20 · 마지막 관측: 2026-09-20
-
관측됨 PROJECT_COMPILE exit 101 E0599 ×1 2.3.0 os=linux sha256:0fbd73add053…error[E0599]: no method named `is_empty` found for struct `Char16Trie<'data>` in the current scoperust/rustc · compiler-diagnostic · outer cargo run증거 품질: complete · 환경 변형: 1 · 최초 관측: 2026-09-20 · 마지막 관측: 2026-09-20
-
관측됨 PROJECT_COMPILE exit 101 E0599 ×1 2.3.0 os=linux icu::normalizer::ComposingNormalizer sha256:16d23d1801b1…error[E0599]: no method named `normalize` found for struct `ComposingNormalizer` in the current scoperust/rustc · compiler-diagnostic · outer cargo run증거 품질: complete · 환경 변형: 1 · 최초 관측: 2026-09-20 · 마지막 관측: 2026-09-20
-
관측됨 PROJECT_COMPILE exit 101 E0599 ×1 2.3.0 os=linux icu::normalizer::ComposingNormalizer sha256:267702ebcc26…error[E0599]: no associated function or constant named `new_nfc_unstable` found for struct `ComposingNormalizer` in the current scoperust/rustc · compiler-diagnostic · outer cargo run증거 품질: complete · 환경 변형: 1 · 최초 관측: 2026-09-20 · 마지막 관측: 2026-09-20
-
관측됨 PROJECT_COMPILE exit 101 E0609 ×1 2.3.0 os=linux sha256:463107715912…error[E0609]: no field `SINGLETON_NORMALIZER_NFC_V1` on type `MyProvider`rust/rustc · compiler-diagnostic · outer cargo run증거 품질: complete · 환경 변형: 1 · 최초 관측: 2026-09-20 · 마지막 관측: 2026-09-20
-
관측됨 PROJECT_COMPILE exit 101 E0599 ×1 2.3.0 os=linux sha256:f752258b26cc…error[E0599]: no method named `as_bytes` found for reference `&Char16Trie<'_>` in the current scoperust/rustc · compiler-diagnostic · outer cargo run증거 품질: complete · 환경 변형: 1 · 최초 관측: 2026-09-20 · 마지막 관측: 2026-09-20