Registroscargoicu2.3.0icu::normalizer::ComposingNormalizer
Cambiar las condiciones
Condiciones actuales
icu::normalizer::ComposingNormalizer @2.3.0linux · glibc · x64 · cargo 1
1 de 5 pasaron
Observado: builds reales de proyectos reportaron desde esta coordenada.
todavía no hay muestra en esta coordenada
- Observaciones de proyectos
- 1 / 5
- Verificaciones de contrato
- nada en esta coordenada
- Peers independientes que reportaron
- 1
- Último registro
- 2026-09-20
Evidencia que puedes abrir
Salud de dependencias
Combinaciones observadas y evidencia de fallos para esta versión
Problemas observados: 1 ·
Estables: 17
Primer fallo observado
2.3.0
linux
5 FAIL
· stage: PROJECT_COMPILE
· fingerprint: sha256:113664d7d9181e86107a4fb50e44d53895730e410223b707c0b72d659b247aef
| Biblioteca | Versión | Estado | Medido allí | Proyectos |
|---|---|---|---|---|
| icu_calendar | 2.3.0 | PASS Todas las observaciones pasaron | compilaciones observadas | 4 días-proyecto |
| icu_casemap | 2.3.0 | PASS Todas las observaciones pasaron | compilaciones observadas | 4 días-proyecto |
| icu_collator | 2.3.1 | PASS Todas las observaciones pasaron | compilaciones observadas | 4 días-proyecto |
| icu_collections | 2.3.0 | PASS Todas las observaciones pasaron | contrato aprobado | 4 días-proyecto |
| icu_datetime | 2.3.0 | PASS Todas las observaciones pasaron | compilaciones observadas | 4 días-proyecto |
| icu_decimal | 2.3.0 | PASS Todas las observaciones pasaron | compilaciones observadas | 4 días-proyecto |
| icu_experimental | 0.6.0 | PASS Todas las observaciones pasaron | compilaciones observadas | 4 días-proyecto |
| icu_list | 2.3.0 | PASS Todas las observaciones pasaron | compilaciones observadas | 4 días-proyecto |
| icu_locale | 2.3.1 | PASS Todas las observaciones pasaron | compilaciones observadas | 4 días-proyecto |
| icu_normalizer | 2.3.0 | PASS Todas las observaciones pasaron | compilaciones observadas | 4 días-proyecto |
| icu_pattern | 0.5.0 | PASS Todas las observaciones pasaron | compilaciones observadas | 4 días-proyecto |
| icu_plurals | 2.3.0 | PASS Todas las observaciones pasaron | compilaciones observadas | 4 días-proyecto |
| icu_properties | 2.3.0 | PASS Todas las observaciones pasaron | contrato aprobado | 4 días-proyecto |
| icu_provider | 2.3.0 | PASS Todas las observaciones pasaron | compilaciones observadas | 1 día-proyecto |
| icu_provider | 2.3.1 | PASS Todas las observaciones pasaron | contrato aprobado | 3 días-proyecto |
| icu_segmenter | 2.3.0 | PASS Todas las observaciones pasaron | compilaciones observadas | 3 días-proyecto |
| icu_time | 2.3.0 | PASS Todas las observaciones pasaron | compilaciones observadas | 2 días-proyecto |
La columna de medición se refiere a la versión de cada dependencia en sí, no al par. Que un resolutor haya colocado dos versiones juntas no prueba que funcionen juntas.
Clústeres de fallos recientes
-
observado PROJECT_COMPILE exit 101 ×5 2.3.0 os=linux icu::normalizer::ComposingNormalizer sha256:113664d7d918…error: could not compile `probe_icu` (bin <str>) due to 1 previous errorrust/rustc · compiler-diagnostic · outer cargo runCalidad de evidencia: complete · Variantes de entorno: 1 · Primer registro: 2026-09-20 · Última observación: 2026-09-20
-
observado PROJECT_COMPILE exit 101 E0599 ×1 2.3.0 os=linux sha256:0fbd73add053…error[E0599]: no method named `is_empty` found for struct `Char16Trie<'data>` in the current scoperust/rustc · compiler-diagnostic · outer cargo runCalidad de evidencia: complete · Variantes de entorno: 1 · Primer registro: 2026-09-20 · Última observación: 2026-09-20
-
observado PROJECT_COMPILE exit 101 E0599 ×1 2.3.0 os=linux icu::normalizer::ComposingNormalizer sha256:16d23d1801b1…error[E0599]: no method named `normalize` found for struct `ComposingNormalizer` in the current scoperust/rustc · compiler-diagnostic · outer cargo runCalidad de evidencia: complete · Variantes de entorno: 1 · Primer registro: 2026-09-20 · Última observación: 2026-09-20
-
observado PROJECT_COMPILE exit 101 E0599 ×1 2.3.0 os=linux icu::normalizer::ComposingNormalizer sha256:267702ebcc26…error[E0599]: no associated function or constant named `new_nfc_unstable` found for struct `ComposingNormalizer` in the current scoperust/rustc · compiler-diagnostic · outer cargo runCalidad de evidencia: complete · Variantes de entorno: 1 · Primer registro: 2026-09-20 · Última observación: 2026-09-20
-
observado PROJECT_COMPILE exit 101 E0609 ×1 2.3.0 os=linux sha256:463107715912…error[E0609]: no field `SINGLETON_NORMALIZER_NFC_V1` on type `MyProvider`rust/rustc · compiler-diagnostic · outer cargo runCalidad de evidencia: complete · Variantes de entorno: 1 · Primer registro: 2026-09-20 · Última observación: 2026-09-20
-
observado PROJECT_COMPILE exit 101 E0599 ×1 2.3.0 os=linux sha256:f752258b26cc…error[E0599]: no method named `as_bytes` found for reference `&Char16Trie<'_>` in the current scoperust/rustc · compiler-diagnostic · outer cargo runCalidad de evidencia: complete · Variantes de entorno: 1 · Primer registro: 2026-09-20 · Última observación: 2026-09-20