Registroscargoicu2.3.0
Mudar as condições
Condições atuais
icu @2.3.0alpine musl · x64 · rust 1 · cargo · rust
total do pacote, não uma API
1 de 1 passaram
Verificado — esta rede executou um contrato nesta coordenada.
há uma amostra aqui e nossa execução nesta coordenada terminou limpa (1)
- Observações de projetos
- 4 / 4
- Verificações de contrato
- 1 / 1
- Registros de uso
- 2
- Peers independentes que reportaram
- 1
- Último registro
- 2026-10-13
Evidências que você pode abrir
Saúde das dependências
Combinações observadas e evidências de falha para esta versão
Problemas observados: 1 ·
Estáveis: 17
Primeira quebra observada
2.3.0
linux
5 FAIL
· stage: PROJECT_COMPILE
· fingerprint: sha256:113664d7d9181e86107a4fb50e44d53895730e410223b707c0b72d659b247aef
| Biblioteca | Versão | Saúde | Medido ali | Projetos |
|---|---|---|---|---|
| icu_calendar | 2.3.0 | PASS Todas as observações passaram | builds observados | 4 dias-projeto |
| icu_casemap | 2.3.0 | PASS Todas as observações passaram | builds observados | 4 dias-projeto |
| icu_collator | 2.3.1 | PASS Todas as observações passaram | builds observados | 4 dias-projeto |
| icu_collections | 2.3.0 | PASS Todas as observações passaram | contrato aprovado | 4 dias-projeto |
| icu_datetime | 2.3.0 | PASS Todas as observações passaram | builds observados | 4 dias-projeto |
| icu_decimal | 2.3.0 | PASS Todas as observações passaram | builds observados | 4 dias-projeto |
| icu_experimental | 0.6.0 | PASS Todas as observações passaram | builds observados | 4 dias-projeto |
| icu_list | 2.3.0 | PASS Todas as observações passaram | builds observados | 4 dias-projeto |
| icu_locale | 2.3.1 | PASS Todas as observações passaram | builds observados | 4 dias-projeto |
| icu_normalizer | 2.3.0 | PASS Todas as observações passaram | builds observados | 4 dias-projeto |
| icu_pattern | 0.5.0 | PASS Todas as observações passaram | builds observados | 4 dias-projeto |
| icu_plurals | 2.3.0 | PASS Todas as observações passaram | builds observados | 4 dias-projeto |
| icu_properties | 2.3.0 | PASS Todas as observações passaram | contrato aprovado | 4 dias-projeto |
| icu_provider | 2.3.0 | PASS Todas as observações passaram | builds observados | 1 dia-projeto |
| icu_provider | 2.3.1 | PASS Todas as observações passaram | contrato aprovado | 3 dias-projeto |
| icu_segmenter | 2.3.0 | PASS Todas as observações passaram | builds observados | 3 dias-projeto |
| icu_time | 2.3.0 | PASS Todas as observações passaram | builds observados | 2 dias-projeto |
A coluna de medição é sobre a versão de cada dependência em si, não sobre o par. Um resolvedor ter colocado duas versões lado a lado não é prova de que funcionam juntas.
Clusters de falha recentes
-
observado PROJECT_COMPILE exit 101 ×5 2.3.0 os=linux sha256:113664d7d918…error: could not compile `probe_icu` (bin <str>) due to 1 previous errorrust/rustc · compiler-diagnostic · outer cargo runQualidade da evidência: complete · Variantes de ambiente: 1 · Primeiro registro: 2026-09-20 · Visto por último: 2026-09-20
-
observado PROJECT_COMPILE exit 101 E0599 ×1 2.3.0 os=linux sha256:0fbd73add053…error[E0599]: no method named `is_empty` found for struct `Char16Trie<'data>` in the current scoperust/rustc · compiler-diagnostic · outer cargo runQualidade da evidência: complete · Variantes de ambiente: 1 · Primeiro registro: 2026-09-20 · Visto por último: 2026-09-20
-
observado PROJECT_COMPILE exit 101 E0599 ×1 2.3.0 os=linux sha256:16d23d1801b1…error[E0599]: no method named `normalize` found for struct `ComposingNormalizer` in the current scoperust/rustc · compiler-diagnostic · outer cargo runQualidade da evidência: complete · Variantes de ambiente: 1 · Primeiro registro: 2026-09-20 · Visto por último: 2026-09-20
-
observado PROJECT_COMPILE exit 101 E0599 ×1 2.3.0 os=linux sha256:267702ebcc26…error[E0599]: no associated function or constant named `new_nfc_unstable` found for struct `ComposingNormalizer` in the current scoperust/rustc · compiler-diagnostic · outer cargo runQualidade da evidência: complete · Variantes de ambiente: 1 · Primeiro registro: 2026-09-20 · Visto por último: 2026-09-20
-
observado PROJECT_COMPILE exit 101 E0609 ×1 2.3.0 os=linux sha256:463107715912…error[E0609]: no field `SINGLETON_NORMALIZER_NFC_V1` on type `MyProvider`rust/rustc · compiler-diagnostic · outer cargo runQualidade da evidência: complete · Variantes de ambiente: 1 · Primeiro registro: 2026-09-20 · Visto por último: 2026-09-20
-
observado PROJECT_COMPILE exit 101 E0599 ×1 2.3.0 os=linux sha256:f752258b26cc…error[E0599]: no method named `as_bytes` found for reference `&Char16Trie<'_>` in the current scoperust/rustc · compiler-diagnostic · outer cargo runQualidade da evidência: complete · Variantes de ambiente: 1 · Primeiro registro: 2026-09-20 · Visto por último: 2026-09-20