Aufzeichnungencargofutures-core0.3.34
Bedingungen ändern
Aktuelle Bedingungen
futures-core @0.3.34ubuntu glibc · x64 · cargo 1
Paketsumme, keine API
4 von 9 bestanden
Beobachtet — echte Projekt-Builds haben von dieser Koordinate berichtet.
hier gibt es ein Sample, und wir haben es an dieser Koordinate noch nicht ausgeführt (2)
- Projektbeobachtungen
- 4 / 9
- Contract-Verifikationen
- nichts an dieser Koordinate
- Nutzungsdatensätze
- 2
- Unabhängig meldende Peers
- 1
- Zuletzt erfasst
- 2026-09-15
Nachweise zum Öffnen
Abhängigkeits-Zustand
Eine Auflösung hat den Baum dieses Releases gelesen und keine Abhängigkeiten gefunden. Das ist eine Messung, keine fehlende.
Aktuelle Fehler-Cluster
-
beobachtet PROJECT_COMPILE exit 101 E0277 ×1 0.3.34 os=linux sha256:079d54d4b2e3…error[E0277]: `T` cannot be unpinned · error[E0277]: `E` cannot be unpinnedrust/rustc · compiler-diagnostic · outer cargo runBeweisqualität: complete · Umgebungsvarianten: 1 · Zuerst erfasst: 2026-09-15 · Zuletzt gesehen: 2026-09-15
-
beobachtet PROJECT_COMPILE exit 101 E0596 ×1 0.3.34 os=linux sha256:543987e39480…error[E0596]: cannot borrow data in dereference of `Pin<&mut ReadyTryFuture<T, E>>` as mutablerust/rustc · compiler-diagnostic · outer cargo runBeweisqualität: complete · Umgebungsvarianten: 1 · Zuerst erfasst: 2026-09-15 · Zuletzt gesehen: 2026-09-15
-
beobachtet PROJECT_COMPILE exit 101 E0119 ×1 0.3.34 os=linux sha256:5fe0d0b2f0ce…error[E0119]: conflicting implementations of trait `TryFuture` for type `ReadyTryFuture<_, _>`rust/rustc · compiler-diagnostic · outer cargo runBeweisqualität: complete · Umgebungsvarianten: 1 · Zuerst erfasst: 2026-09-15 · Zuletzt gesehen: 2026-09-15
-
beobachtet PROJECT_COMPILE exit 101 ×1 0.3.34 os=linux sha256:8f6f2276b3f1…error: could not compile `sample-futures-core` (bin <str>) due to 2 previous errors; 1 warning emittedrust/rustc · compiler-diagnostic · outer cargo runBeweisqualität: complete · Umgebungsvarianten: 1 · Zuerst erfasst: 2026-09-15 · Zuletzt gesehen: 2026-09-15
-
beobachtet PROJECT_COMPILE exit 101 ×1 0.3.34 os=linux sha256:e3dee1f39a56…error: could not compile `sample-futures-core` (bin <str>) due to 2 previous errorsrust/rustc · compiler-diagnostic · outer cargo runBeweisqualität: complete · Umgebungsvarianten: 1 · Zuerst erfasst: 2026-09-15 · Zuletzt gesehen: 2026-09-15