Registroscargofutures-core0.3.34futures_core
Cambiar las condiciones
Condiciones actuales
futures_core @0.3.34alpine musl · x64 · rust 1 · cargo · rust
1 de 1 pasaron
Verificado: esta red ejecutó un contrato en esta coordenada.
hay una muestra aquí y nuestra ejecución en esta coordenada terminó limpia (1)
- Observaciones de proyectos
- 2 / 2
- Verificaciones de contrato
- 1 / 1
- Peers independientes que reportaron
- 1
- Último registro
- 2026-09-17
Evidencia que puedes abrir
Salud de dependencias
Una resolución leyó el árbol de esta versión y no encontró dependencias. Es una medición, no una que falte.
Clústeres de fallos recientes
-
observado PROJECT_COMPILE exit 101 E0277 ×1 0.3.34 os=linux futures_core sha256:079d54d4b2e3…error[E0277]: `T` cannot be unpinned · error[E0277]: `E` cannot be unpinnedrust/rustc · compiler-diagnostic · outer cargo runCalidad de evidencia: complete · Variantes de entorno: 1 · Primer registro: 2026-09-15 · Última observación: 2026-09-15
-
observado PROJECT_COMPILE exit 101 E0596 ×1 0.3.34 os=linux futures_core sha256:543987e39480…error[E0596]: cannot borrow data in dereference of `Pin<&mut ReadyTryFuture<T, E>>` as mutablerust/rustc · compiler-diagnostic · outer cargo runCalidad de evidencia: complete · Variantes de entorno: 1 · Primer registro: 2026-09-15 · Última observación: 2026-09-15
-
observado PROJECT_COMPILE exit 101 E0119 ×1 0.3.34 os=linux futures_core sha256:5fe0d0b2f0ce…error[E0119]: conflicting implementations of trait `TryFuture` for type `ReadyTryFuture<_, _>`rust/rustc · compiler-diagnostic · outer cargo runCalidad de evidencia: complete · Variantes de entorno: 1 · Primer registro: 2026-09-15 · Última observación: 2026-09-15
-
observado PROJECT_COMPILE exit 101 ×1 0.3.34 os=linux futures_core sha256:8f6f2276b3f1…error: could not compile `sample-futures-core` (bin <str>) due to 2 previous errors; 1 warning emittedrust/rustc · compiler-diagnostic · outer cargo runCalidad de evidencia: complete · Variantes de entorno: 1 · Primer registro: 2026-09-15 · Última observación: 2026-09-15
-
observado PROJECT_COMPILE exit 101 ×1 0.3.34 os=linux futures_core sha256:e3dee1f39a56…error: could not compile `sample-futures-core` (bin <str>) due to 2 previous errorsrust/rustc · compiler-diagnostic · outer cargo runCalidad de evidencia: complete · Variantes de entorno: 1 · Primer registro: 2026-09-15 · Última observación: 2026-09-15