기록cargofutures-core0.3.34
조건 변경
현재 조건
futures-core @0.3.34ubuntu glibc · x64 · cargo 1
API가 아니라 패키지 전체 집계
9회 중 4회 통과
관측 — 실제 프로젝트 빌드가 이 좌표에서 보고되었습니다.
샘플 있음 — 이 좌표에서는 아직 우리가 실행하지 않음 (2)
- 프로젝트 관측
- 4 / 9
- 컨트랙트 검증
- 이 좌표에는 없음
- 사용 기록
- 2
- 독립 보고 peer
- 1
- 마지막 기록
- 2026-09-15
열어 볼 수 있는 증거
의존성 건강도
어떤 해결 과정이 이 릴리스의 트리를 읽었고 의존성이 없었습니다. 빠진 것이 아니라 측정된 것입니다.
최근 실패 클러스터
-
관측됨 PROJECT_COMPILE exit 101 E0277 ×1 0.3.34 os=linux sha256:079d54d4b2e3…error[E0277]: `T` cannot be unpinned · error[E0277]: `E` cannot be unpinnedrust/rustc · compiler-diagnostic · outer cargo run증거 품질: complete · 환경 변형: 1 · 최초 관측: 2026-09-15 · 마지막 관측: 2026-09-15
-
관측됨 PROJECT_COMPILE exit 101 E0596 ×1 0.3.34 os=linux sha256:543987e39480…error[E0596]: cannot borrow data in dereference of `Pin<&mut ReadyTryFuture<T, E>>` as mutablerust/rustc · compiler-diagnostic · outer cargo run증거 품질: complete · 환경 변형: 1 · 최초 관측: 2026-09-15 · 마지막 관측: 2026-09-15
-
관측됨 PROJECT_COMPILE exit 101 E0119 ×1 0.3.34 os=linux sha256:5fe0d0b2f0ce…error[E0119]: conflicting implementations of trait `TryFuture` for type `ReadyTryFuture<_, _>`rust/rustc · compiler-diagnostic · outer cargo run증거 품질: complete · 환경 변형: 1 · 최초 관측: 2026-09-15 · 마지막 관측: 2026-09-15
-
관측됨 PROJECT_COMPILE exit 101 ×1 0.3.34 os=linux sha256:8f6f2276b3f1…error: could not compile `sample-futures-core` (bin <str>) due to 2 previous errors; 1 warning emittedrust/rustc · compiler-diagnostic · outer cargo run증거 품질: complete · 환경 변형: 1 · 최초 관측: 2026-09-15 · 마지막 관측: 2026-09-15
-
관측됨 PROJECT_COMPILE exit 101 ×1 0.3.34 os=linux sha256:e3dee1f39a56…error: could not compile `sample-futures-core` (bin <str>) due to 2 previous errorsrust/rustc · compiler-diagnostic · outer cargo run증거 품질: complete · 환경 변형: 1 · 최초 관측: 2026-09-15 · 마지막 관측: 2026-09-15