記録cargofutures-core0.3.34
条件を変更
現在の条件
futures-core @0.3.34ubuntu glibc · x64 · cargo 1
API ではなくパッケージ全体の合計
9 回中 4 回が成功
観測 — 実際のプロジェクトのビルドがこの座標から報告されました。
サンプルあり — この座標ではまだ実行していない (2)
- プロジェクト観測
- 4 / 9
- コントラクト検証
- この座標にはなし
- 使用記録
- 2
- 独立した報告ピア
- 1
- 最終記録
- 2026-09-15
開ける証拠
依存関係のヘルス
ある解決処理がこのリリースのツリーを読み、依存関係はありませんでした。欠落ではなく測定結果です。
最近の失敗クラスター
-
観測済み PROJECT_COMPILE exit 101 E0277 ×1 0.3.34 os=linux sha256:079d54d4b2e3…error[E0277]: `T` cannot be unpinned · error[E0277]: `E` cannot be unpinnedrust/rustc · compiler-diagnostic · outer cargo run証拠品質: complete · 環境バリアント: 1 · 初回記録: 2026-09-15 · 最終観測: 2026-09-15
-
観測済み PROJECT_COMPILE exit 101 E0596 ×1 0.3.34 os=linux sha256:543987e39480…error[E0596]: cannot borrow data in dereference of `Pin<&mut ReadyTryFuture<T, E>>` as mutablerust/rustc · compiler-diagnostic · outer cargo run証拠品質: complete · 環境バリアント: 1 · 初回記録: 2026-09-15 · 最終観測: 2026-09-15
-
観測済み PROJECT_COMPILE exit 101 E0119 ×1 0.3.34 os=linux sha256:5fe0d0b2f0ce…error[E0119]: conflicting implementations of trait `TryFuture` for type `ReadyTryFuture<_, _>`rust/rustc · compiler-diagnostic · outer cargo run証拠品質: complete · 環境バリアント: 1 · 初回記録: 2026-09-15 · 最終観測: 2026-09-15
-
観測済み PROJECT_COMPILE exit 101 ×1 0.3.34 os=linux sha256:8f6f2276b3f1…error: could not compile `sample-futures-core` (bin <str>) due to 2 previous errors; 1 warning emittedrust/rustc · compiler-diagnostic · outer cargo run証拠品質: complete · 環境バリアント: 1 · 初回記録: 2026-09-15 · 最終観測: 2026-09-15
-
観測済み PROJECT_COMPILE exit 101 ×1 0.3.34 os=linux sha256:e3dee1f39a56…error: could not compile `sample-futures-core` (bin <str>) due to 2 previous errorsrust/rustc · compiler-diagnostic · outer cargo run証拠品質: complete · 環境バリアント: 1 · 初回記録: 2026-09-15 · 最終観測: 2026-09-15