Recordscargofutures-core0.3.34
Change the conditions
Current conditions
futures-core @0.3.34alpine musl · x64 · rust 1 · cargo · rust
package-level total, not an API
2 of 2 passed
Verified — this network ran a contract at this coordinate.
there is a sample here, and our run of it at this coordinate came back clean (2)
- Project observations
- 4 / 4
- Contract verifications
- 2 / 2
- Usage records
- 2
- Independent reporting peers
- 1
- Last recorded
- 2026-09-17
Evidence you can open
Dependency Health
A resolution read this release's tree and found no dependencies. That is a measurement, not a missing one.
Recent failure clusters
-
observed PROJECT_COMPILE exit 101 E0277 ×1 0.3.34 os=linux sha256:079d54d4b2e3…error[E0277]: `T` cannot be unpinned · error[E0277]: `E` cannot be unpinnedrust/rustc · compiler-diagnostic · outer cargo runEvidence quality: complete · Environment variants: 1 · First recorded: 2026-09-15 · Last seen: 2026-09-15
-
observed PROJECT_COMPILE exit 101 E0596 ×1 0.3.34 os=linux sha256:543987e39480…error[E0596]: cannot borrow data in dereference of `Pin<&mut ReadyTryFuture<T, E>>` as mutablerust/rustc · compiler-diagnostic · outer cargo runEvidence quality: complete · Environment variants: 1 · First recorded: 2026-09-15 · Last seen: 2026-09-15
-
observed PROJECT_COMPILE exit 101 E0119 ×1 0.3.34 os=linux sha256:5fe0d0b2f0ce…error[E0119]: conflicting implementations of trait `TryFuture` for type `ReadyTryFuture<_, _>`rust/rustc · compiler-diagnostic · outer cargo runEvidence quality: complete · Environment variants: 1 · First recorded: 2026-09-15 · Last seen: 2026-09-15
-
observed PROJECT_COMPILE exit 101 ×1 0.3.34 os=linux sha256:8f6f2276b3f1…error: could not compile `sample-futures-core` (bin <str>) due to 2 previous errors; 1 warning emittedrust/rustc · compiler-diagnostic · outer cargo runEvidence quality: complete · Environment variants: 1 · First recorded: 2026-09-15 · Last seen: 2026-09-15
-
observed PROJECT_COMPILE exit 101 ×1 0.3.34 os=linux sha256:e3dee1f39a56…error: could not compile `sample-futures-core` (bin <str>) due to 2 previous errorsrust/rustc · compiler-diagnostic · outer cargo runEvidence quality: complete · Environment variants: 1 · First recorded: 2026-09-15 · Last seen: 2026-09-15