Registroscargoflate21.1.10
Cambiar las condiciones
Condiciones actuales
flate2 @1.1.10ubuntu glibc · x64 · cargo 1
total del paquete, no una API
0 de 1 pasaron
Verificado: esta red ejecutó un contrato en esta coordenada.
hay una muestra aquí y nuestra ejecución en esta coordenada falló
- Observaciones de proyectos
- 10 / 16
- Verificaciones de contrato
- 0 / 1
- Peers independientes que reportaron
- 1
- Último registro
- 2026-09-19
Evidencia que puedes abrir
Salud de dependencias
Combinaciones observadas y evidencia de fallos para esta versión
Problemas observados: 1 ·
Estables: 3
Primer fallo observado
1.1.10
linux
2 FAIL
· stage: PROJECT_COMPILE
· fingerprint: sha256:40827ed6270443985b87902d50b257ee40df217d061c0098b7070f9287145dc9
| Biblioteca | Versión | Estado | Medido allí | Proyectos |
|---|---|---|---|---|
| crc32fast | 1.5.2 | PASS Todas las observaciones pasaron | contrato aprobado | 3 días-proyecto |
| miniz_oxide | 0.9.1 | PASS Todas las observaciones pasaron | contrato aprobado | 3 días-proyecto |
| zlib-rs | 0.6.8 | PASS Todas las observaciones pasaron | contrato aprobado | 3 días-proyecto |
La columna de medición se refiere a la versión de cada dependencia en sí, no al par. Que un resolutor haya colocado dos versiones juntas no prueba que funcionen juntas.
Clústeres de fallos recientes
-
observado PROJECT_COMPILE exit 101 E0599 ×2 1.1.10 os=linux sha256:40827ed62704…error[E0599]: no method named `is_none` found for tuple `(u64, u64, addr2line::Location<'_>)` in the current scoperust/rustc · compiler-diagnostic · outer cargo runCalidad de evidencia: complete · Variantes de entorno: 1 · Primer registro: 2026-09-19 · Última observación: 2026-09-19
-
observado PROJECT_COMPILE exit 101 ×1 1.1.10 os=linux sha256:7e12f411f813…error: could not compile `test_addr2line` (bin <str>) due to 1 previous errorrust/rustc · compiler-diagnostic · outer cargo runCalidad de evidencia: complete · Variantes de entorno: 1 · Primer registro: 2026-09-19 · Última observación: 2026-09-19
-
observado PROJECT_COMPILE exit 101 ×1 1.1.10 os=linux sha256:9d9b6169d6bd…error: could not compile `test_addr2line` (bin <str>) due to 9 previous errorsrust/rustc · compiler-diagnostic · outer cargo runCalidad de evidencia: complete · Variantes de entorno: 1 · Primer registro: 2026-09-19 · Última observación: 2026-09-19
-
observado PROJECT_COMPILE exit 101 E0063 ×1 1.1.10 os=linux sha256:b4d73c642e61…error[E0063]: missing fields `debug_macinfo` and `debug_macro` in initializer of `Dwarf<_>`rust/rustc · compiler-diagnostic · outer cargo runCalidad de evidencia: complete · Variantes de entorno: 1 · Primer registro: 2026-09-19 · Última observación: 2026-09-19
-
observado PROJECT_COMPILE exit 101 E0061 ×1 1.1.10 os=linux sha256:db7a3103c11e…error[E0061]: this function takes 2 arguments but 1 argument was suppliedrust/rustc · compiler-diagnostic · outer cargo runCalidad de evidencia: complete · Variantes de entorno: 1 · Primer registro: 2026-09-19 · Última observación: 2026-09-19
-
observado UNKNOWN exit 101 Brecha de evidencia ×1 1.1.10 os=linux sha256:c970c257481f…Compiling cfg-if v1.0.5 · Compiling simd-adler32 v0.3.10 · Compiling adler2 v2.0.1 · Compiling crc32fast v1.5.2cargo · unclassified-diagnostic · outer cargo run · gap stage-unknownCalidad de evidencia: complete · Variantes de entorno: 1 · Primer registro: 2026-09-19 · Última observación: 2026-09-19Candidato a reverificación diagnóstica