Записиcargofixed_decimal0.7.2
Изменить условия
Текущие условия
fixed_decimal @0.7.2ubuntu glibc · x64 · cargo 1
итог по пакету, а не API
3 из 13 прошли
Наблюдение — реальные сборки проектов сообщили об этой координате.
в этой координате образца пока нет
- Наблюдения в проектах
- 3 / 13
- Проверки контрактом
- в этой координате ничего
- Независимые сообщившие пиры
- 1
- Последняя запись
- 2026-09-20
Свидетельства, которые можно открыть
Здоровье зависимостей
Наблюдаемые комбинации и свидетельства сбоев для этого выпуска
Замечено проблем: 1 ·
Стабильно: 3
Первый обнаруженный сбой
0.7.2
linux
5 FAIL
· stage: PROJECT_COMPILE
· fingerprint: sha256:113664d7d9181e86107a4fb50e44d53895730e410223b707c0b72d659b247aef
| Библиотека | Версия | Состояние | Измерено там | Проектов |
|---|---|---|---|---|
| displaydoc | 0.2.7 | PASS Все наблюдения прошли успешно | контракт пройден | 4 проектных дня |
| smallvec | 1.16.1 | PASS Все наблюдения прошли успешно | контракт пройден | 4 проектных дня |
| writeable | 0.6.4 | PASS Все наблюдения прошли успешно | контракт пройден | 4 проектных дня |
Столбец измерения относится к релизу самой зависимости, а не к паре. То, что резолвер поставил два релиза рядом, не доказывает, что они работают вместе.
Недавние кластеры сбоев
-
наблюдалось PROJECT_COMPILE exit 101 ×5 0.7.2 os=linux sha256:113664d7d918…error: could not compile `probe_icu` (bin <str>) due to 1 previous errorrust/rustc · compiler-diagnostic · outer cargo runКачество данных: complete · Варианты среды: 1 · Первая запись: 2026-09-20 · Последнее наблюдение: 2026-09-20
-
наблюдалось PROJECT_COMPILE exit 101 E0599 ×1 0.7.2 os=linux sha256:0fbd73add053…error[E0599]: no method named `is_empty` found for struct `Char16Trie<'data>` in the current scoperust/rustc · compiler-diagnostic · outer cargo runКачество данных: complete · Варианты среды: 1 · Первая запись: 2026-09-20 · Последнее наблюдение: 2026-09-20
-
наблюдалось PROJECT_COMPILE exit 101 E0599 ×1 0.7.2 os=linux sha256:16d23d1801b1…error[E0599]: no method named `normalize` found for struct `ComposingNormalizer` in the current scoperust/rustc · compiler-diagnostic · outer cargo runКачество данных: complete · Варианты среды: 1 · Первая запись: 2026-09-20 · Последнее наблюдение: 2026-09-20
-
наблюдалось PROJECT_COMPILE exit 101 E0599 ×1 0.7.2 os=linux sha256:267702ebcc26…error[E0599]: no associated function or constant named `new_nfc_unstable` found for struct `ComposingNormalizer` in the current scoperust/rustc · compiler-diagnostic · outer cargo runКачество данных: complete · Варианты среды: 1 · Первая запись: 2026-09-20 · Последнее наблюдение: 2026-09-20
-
наблюдалось PROJECT_COMPILE exit 101 E0609 ×1 0.7.2 os=linux sha256:463107715912…error[E0609]: no field `SINGLETON_NORMALIZER_NFC_V1` on type `MyProvider`rust/rustc · compiler-diagnostic · outer cargo runКачество данных: complete · Варианты среды: 1 · Первая запись: 2026-09-20 · Последнее наблюдение: 2026-09-20
-
наблюдалось PROJECT_COMPILE exit 101 E0599 ×1 0.7.2 os=linux sha256:f752258b26cc…error[E0599]: no method named `as_bytes` found for reference `&Char16Trie<'_>` in the current scoperust/rustc · compiler-diagnostic · outer cargo runКачество данных: complete · Варианты среды: 1 · Первая запись: 2026-09-20 · Последнее наблюдение: 2026-09-20