기록cargocrc32fast1.5.2
조건 변경
현재 조건
crc32fast @1.5.2alpine musl · x64 · rust 1 · cargo · rust
API가 아니라 패키지 전체 집계
프로젝트에 존재한 기록만 있습니다. 이 좌표에서 실행된 것은 없습니다.
관측 — 실제 프로젝트 빌드가 이 좌표에서 보고되었습니다.
이 좌표에는 아직 샘플이 없음
- 프로젝트 관측
- 이 좌표에는 없음
- 컨트랙트 검증
- 이 좌표에는 없음
- 사용 기록
- 1
- 독립 보고 peer
- 1
- 마지막 기록
- 2026-09-19
열어 볼 수 있는 증거
의존성 건강도
이 릴리스의 의존성 조합과 실패 관측 결과
관측된 문제 1건 ·
정상 1건
측정 열은 각 의존성 자신의 릴리스에 대한 것이지 두 릴리스의 조합에 대한 것이 아닙니다. 리졸버가 둘을 나란히 놓았다는 사실은 함께 동작한다는 증거가 아닙니다.
최근 실패 클러스터
-
관측됨 PROJECT_COMPILE exit 101 E0599 ×2 1.5.2 os=linux sha256:40827ed62704…error[E0599]: no method named `is_none` found for tuple `(u64, u64, addr2line::Location<'_>)` in the current scoperust/rustc · compiler-diagnostic · outer cargo run증거 품질: complete · 환경 변형: 1 · 최초 관측: 2026-09-19 · 마지막 관측: 2026-09-19
-
관측됨 PROJECT_COMPILE exit 101 ×1 1.5.2 os=linux sha256:7e12f411f813…error: could not compile `test_addr2line` (bin <str>) due to 1 previous errorrust/rustc · compiler-diagnostic · outer cargo run증거 품질: complete · 환경 변형: 1 · 최초 관측: 2026-09-19 · 마지막 관측: 2026-09-19
-
관측됨 PROJECT_COMPILE exit 101 ×1 1.5.2 os=linux sha256:9d9b6169d6bd…error: could not compile `test_addr2line` (bin <str>) due to 9 previous errorsrust/rustc · compiler-diagnostic · outer cargo run증거 품질: complete · 환경 변형: 1 · 최초 관측: 2026-09-19 · 마지막 관측: 2026-09-19
-
관측됨 PROJECT_COMPILE exit 101 E0063 ×1 1.5.2 os=linux sha256:b4d73c642e61…error[E0063]: missing fields `debug_macinfo` and `debug_macro` in initializer of `Dwarf<_>`rust/rustc · compiler-diagnostic · outer cargo run증거 품질: complete · 환경 변형: 1 · 최초 관측: 2026-09-19 · 마지막 관측: 2026-09-19
-
관측됨 PROJECT_COMPILE exit 101 E0061 ×1 1.5.2 os=linux sha256:db7a3103c11e…error[E0061]: this function takes 2 arguments but 1 argument was suppliedrust/rustc · compiler-diagnostic · outer cargo run증거 품질: complete · 환경 변형: 1 · 최초 관측: 2026-09-19 · 마지막 관측: 2026-09-19
-
관측됨 UNKNOWN exit 101 증거 공백 ×1 1.5.2 os=linux sha256:c970c257481f…Compiling cfg-if v1.0.5 · Compiling simd-adler32 v0.3.10 · Compiling adler2 v2.0.1 · Compiling crc32fast v1.5.2cargo · unclassified-diagnostic · outer cargo run · gap stage-unknown증거 품질: complete · 환경 변형: 1 · 최초 관측: 2026-09-19 · 마지막 관측: 2026-09-19진단 재검증 후보