Aufzeichnungencargocrc32fast1.5.2
Bedingungen ändern
Aktuelle Bedingungen
crc32fast @1.5.2linux · musl · x64 · rust 1 · cargo · rust
Paketsumme, keine API
Als in Projekten vorhanden erfasst. An dieser Koordinate wurde nichts ausgeführt.
Beobachtet — echte Projekt-Builds haben von dieser Koordinate berichtet.
an dieser Koordinate noch kein Sample
- Projektbeobachtungen
- nichts an dieser Koordinate
- Contract-Verifikationen
- nichts an dieser Koordinate
- Nutzungsdatensätze
- 1
- Unabhängig meldende Peers
- 1
- Zuletzt erfasst
- 2026-09-19
Nachweise zum Öffnen
Abhängigkeits-Zustand
Beobachtete Kombinationen und Fehlernachweise für dieses Release
Beobachtete Probleme: 1 ·
Stabil: 1
Erster beobachteter Fehler
1.5.2
linux
2 FAIL
· stage: PROJECT_COMPILE
· fingerprint: sha256:40827ed6270443985b87902d50b257ee40df217d061c0098b7070f9287145dc9
| Bibliothek | Version | Zustand | Dort gemessen | Projekte |
|---|---|---|---|---|
| cfg-if | 1.0.5 | PASS Alle Beobachtungen bestanden | Contract bestanden | 3 Projekttage |
Die Messspalte betrifft das Release der jeweiligen Abhängigkeit selbst, nicht das Paar. Dass ein Resolver zwei Releases nebeneinandergestellt hat, ist kein Beleg dafür, dass sie zusammen funktionieren.
Aktuelle Fehler-Cluster
-
beobachtet PROJECT_COMPILE exit 101 E0599 ×2 1.5.2 os=linux sha256:40827ed62704…error[E0599]: no method named `is_none` found for tuple `(u64, u64, addr2line::Location<'_>)` in the current scoperust/rustc · compiler-diagnostic · outer cargo runBeweisqualität: complete · Umgebungsvarianten: 1 · Zuerst erfasst: 2026-09-19 · Zuletzt gesehen: 2026-09-19
-
beobachtet PROJECT_COMPILE exit 101 ×1 1.5.2 os=linux sha256:7e12f411f813…error: could not compile `test_addr2line` (bin <str>) due to 1 previous errorrust/rustc · compiler-diagnostic · outer cargo runBeweisqualität: complete · Umgebungsvarianten: 1 · Zuerst erfasst: 2026-09-19 · Zuletzt gesehen: 2026-09-19
-
beobachtet PROJECT_COMPILE exit 101 ×1 1.5.2 os=linux sha256:9d9b6169d6bd…error: could not compile `test_addr2line` (bin <str>) due to 9 previous errorsrust/rustc · compiler-diagnostic · outer cargo runBeweisqualität: complete · Umgebungsvarianten: 1 · Zuerst erfasst: 2026-09-19 · Zuletzt gesehen: 2026-09-19
-
beobachtet PROJECT_COMPILE exit 101 E0063 ×1 1.5.2 os=linux sha256:b4d73c642e61…error[E0063]: missing fields `debug_macinfo` and `debug_macro` in initializer of `Dwarf<_>`rust/rustc · compiler-diagnostic · outer cargo runBeweisqualität: complete · Umgebungsvarianten: 1 · Zuerst erfasst: 2026-09-19 · Zuletzt gesehen: 2026-09-19
-
beobachtet PROJECT_COMPILE exit 101 E0061 ×1 1.5.2 os=linux sha256:db7a3103c11e…error[E0061]: this function takes 2 arguments but 1 argument was suppliedrust/rustc · compiler-diagnostic · outer cargo runBeweisqualität: complete · Umgebungsvarianten: 1 · Zuerst erfasst: 2026-09-19 · Zuletzt gesehen: 2026-09-19
-
beobachtet UNKNOWN exit 101 Beweislücke ×1 1.5.2 os=linux sha256:c970c257481f…Compiling cfg-if v1.0.5 · Compiling simd-adler32 v0.3.10 · Compiling adler2 v2.0.1 · Compiling crc32fast v1.5.2cargo · unclassified-diagnostic · outer cargo run · gap stage-unknownBeweisqualität: complete · Umgebungsvarianten: 1 · Zuerst erfasst: 2026-09-19 · Zuletzt gesehen: 2026-09-19Kandidat für diagnostische Neuprüfung