记录cargocore_maths0.1.1
更改条件
依赖健康度
此版本的依赖组合与失败观测
观测到问题 1 项 ·
正常 1 项
测量列说的是每个依赖自身版本的情况,而不是这一对的情况。解析器把两个版本放在一起,并不证明它们能协同工作。
近期失败聚类
-
已观测 PROJECT_COMPILE exit 101 ×5 0.1.1 os=linux sha256:113664d7d918…error: could not compile `probe_icu` (bin <str>) due to 1 previous errorrust/rustc · compiler-diagnostic · outer cargo run证据质量: complete · 环境变体: 1 · 首次记录: 2026-09-20 · 最近观测: 2026-09-20
-
已观测 PROJECT_COMPILE exit 101 E0599 ×1 0.1.1 os=linux sha256:0fbd73add053…error[E0599]: no method named `is_empty` found for struct `Char16Trie<'data>` in the current scoperust/rustc · compiler-diagnostic · outer cargo run证据质量: complete · 环境变体: 1 · 首次记录: 2026-09-20 · 最近观测: 2026-09-20
-
已观测 PROJECT_COMPILE exit 101 E0599 ×1 0.1.1 os=linux sha256:16d23d1801b1…error[E0599]: no method named `normalize` found for struct `ComposingNormalizer` in the current scoperust/rustc · compiler-diagnostic · outer cargo run证据质量: complete · 环境变体: 1 · 首次记录: 2026-09-20 · 最近观测: 2026-09-20
-
已观测 PROJECT_COMPILE exit 101 E0599 ×1 0.1.1 os=linux sha256:267702ebcc26…error[E0599]: no associated function or constant named `new_nfc_unstable` found for struct `ComposingNormalizer` in the current scoperust/rustc · compiler-diagnostic · outer cargo run证据质量: complete · 环境变体: 1 · 首次记录: 2026-09-20 · 最近观测: 2026-09-20
-
已观测 PROJECT_COMPILE exit 101 E0609 ×1 0.1.1 os=linux sha256:463107715912…error[E0609]: no field `SINGLETON_NORMALIZER_NFC_V1` on type `MyProvider`rust/rustc · compiler-diagnostic · outer cargo run证据质量: complete · 环境变体: 1 · 首次记录: 2026-09-20 · 最近观测: 2026-09-20
-
已观测 PROJECT_COMPILE exit 101 E0599 ×1 0.1.1 os=linux sha256:f752258b26cc…error[E0599]: no method named `as_bytes` found for reference `&Char16Trie<'_>` in the current scoperust/rustc · compiler-diagnostic · outer cargo run证据质量: complete · 环境变体: 1 · 首次记录: 2026-09-20 · 最近观测: 2026-09-20