Aufzeichnungencargocc1.4.7
Umgebungsdetails
Beobachtungen auf Projektebene und Symbol-/Contract-Verifizierungen werden getrennt gezählt und niemals zusammengerechnet.
Diese Zahlen unterscheiden nicht, wie das Symbol aufgerufen wurde: Überladungen, Argumentformen und Optionen werden zusammengefasst. Was eine bestimmte Aufrufform tut, beweist der Vertrag eines Samples – nicht diese Zahlen.
| Umgebung | Konfidenz | Beobachtungen | Verifiziert | Erfolgsquote | Peers | Zuletzt gesehen |
|---|---|---|---|---|---|---|
| unknown · Rust · cargo · linux glibc
Beobachtungen: PROJECT_COMPILE 0✓ 6✕ · PROJECT_PROCESS 9✓ · PROJECT_TEST 1✓ — Verifiziert: UNKNOWN 0✓ 1✕
|
ELEVATED FAILURE | 16 | 1 | 59 % | 1 | 2026-09-20 |
| rust 1 · Rust · cargo · linux musl · docker
Nutzung: USED 2✓
|
LOW | 0 +2 | 0 | — | 1 | 2026-10-09 |
Aktuelle Fehler-Cluster
-
beobachtet PROJECT_COMPILE exit 101 E0616 ×2 1.4.7 os=linux sha256:581c58c1c7ac…error[E0616]: field `output_len` of struct `ring::digest::Algorithm` is privaterust/rustc · compiler-diagnostic · outer cargo run, cargo testBeweisqualität: complete · Umgebungsvarianten: 1 · Zuerst erfasst: 2026-09-20 · Zuletzt gesehen: 2026-09-20
-
beobachtet PROJECT_COMPILE exit 101 ×1 1.4.7 os=linux sha256:24ec7982ffbe…error: could not compile `test-ring` (bin <str>) due to 1 previous errorrust/rustc · compiler-diagnostic · outer cargo runBeweisqualität: complete · Umgebungsvarianten: 1 · Zuerst erfasst: 2026-09-20 · Zuletzt gesehen: 2026-09-20
-
beobachtet PROJECT_COMPILE exit 101 ×1 1.4.7 os=linux sha256:5ef222f665b3…error: could not compile `sample-ring-digest` (bin <str>) due to 2 previous errorsrust/rustc · compiler-diagnostic · outer cargo runBeweisqualität: complete · Umgebungsvarianten: 1 · Zuerst erfasst: 2026-09-20 · Zuletzt gesehen: 2026-09-20
-
beobachtet PROJECT_COMPILE exit 101 ×1 1.4.7 os=linux sha256:b7a3fa5852a8…error: could not compile `ring-digest-test` (lib test) due to 1 previous error; 1 warning emittedrust/rustc · compiler-diagnostic · outer cargo testBeweisqualität: complete · Umgebungsvarianten: 1 · Zuerst erfasst: 2026-09-20 · Zuletzt gesehen: 2026-09-20
-
beobachtet PROJECT_COMPILE exit 101 E0599 ×1 1.4.7 os=linux sha256:ddd135697656…error[E0599]: no method named `public_key` found for struct `Ed25519KeyPair` in the current scoperust/rustc · compiler-diagnostic · outer cargo runBeweisqualität: complete · Umgebungsvarianten: 1 · Zuerst erfasst: 2026-09-20 · Zuletzt gesehen: 2026-09-20
-
beobachtet UNKNOWN exit 101 Beweislücke ×1 1.4.7 os=linux sha256:58d2cf0f1acc…Compiling sample-ring-digest v1.0.0 (<path> · Finished `dev` profile [unoptimized + debuginfo] target(s) in 0.18s · Running `target/debug/contract` …cargo · unclassified-diagnostic · outer cargo run · gap stage-unknownBeweisqualität: complete · Umgebungsvarianten: 1 · Zuerst erfasst: 2026-09-20 · Zuletzt gesehen: 2026-09-20Kandidat für diagnostische Neuprüfung
Symbole
Noch keine Symbole mit Evidenz.