Aufzeichnungencargocc1.4.6
Umgebungsdetails
Beobachtungen auf Projektebene und Symbol-/Contract-Verifizierungen werden getrennt gezählt und niemals zusammengerechnet.
Diese Zahlen unterscheiden nicht, wie das Symbol aufgerufen wurde: Überladungen, Argumentformen und Optionen werden zusammengefasst. Was eine bestimmte Aufrufform tut, beweist der Vertrag eines Samples – nicht diese Zahlen.
| Umgebung | Konfidenz | Beobachtungen | Verifiziert | Erfolgsquote | Peers | Zuletzt gesehen |
|---|---|---|---|---|---|---|
| unknown · Rust · cargo · linux glibc
Beobachtungen: PROJECT_COMPILE 1✓ 5✕ · PROJECT_PROCESS 3✓ — Verifiziert: UNKNOWN 0✓ 1✕
|
ELEVATED FAILURE | 9 | 1 | 40 % | 1 | 2026-09-19 |
| rust 1 · Rust · cargo · linux musl · docker
Nutzung: USED 1✓
|
LOW | 0 +1 | 0 | — | 1 | 2026-09-19 |
Aktuelle Fehler-Cluster
-
beobachtet PROJECT_COMPILE exit 101 ×1 1.4.6 os=linux sha256:104f536c9704…error: could not compile `probe` (bin <str>) due to 2 previous errorsrust/rustc · compiler-diagnostic · outer cargo runBeweisqualität: complete · Umgebungsvarianten: 1 · Zuerst erfasst: 2026-09-19 · Zuletzt gesehen: 2026-09-19
-
beobachtet PROJECT_COMPILE exit 101 E0599 ×1 1.4.6 os=linux sha256:5b0ef21330f9…error[E0599]: no associated function or constant named `SERVER_AUTH` found for struct `KeyPurposeId<'a>` in the current scoperust/rustc · compiler-diagnostic · outer cargo checkBeweisqualität: complete · Umgebungsvarianten: 1 · Zuerst erfasst: 2026-09-19 · Zuletzt gesehen: 2026-09-19
-
beobachtet PROJECT_COMPILE exit 101 E0599 ×1 1.4.6 os=linux sha256:8c25141af213…error[E0599]: no variant, associated function, or constant named `CACompromise` found for enum `webpki::RevocationReason` in the current scoperust/rustc · compiler-diagnostic · outer cargo runBeweisqualität: complete · Umgebungsvarianten: 1 · Zuerst erfasst: 2026-09-19 · Zuletzt gesehen: 2026-09-19
-
beobachtet PROJECT_COMPILE exit 101 E0423 ×1 1.4.6 os=linux sha256:a4ccb879052a…error[E0423]: cannot initialize a tuple struct which contains private fieldsrust/rustc · compiler-diagnostic · outer cargo runBeweisqualität: complete · Umgebungsvarianten: 1 · Zuerst erfasst: 2026-09-19 · Zuletzt gesehen: 2026-09-19
-
beobachtet PROJECT_COMPILE exit 101 ×1 1.4.6 os=linux sha256:d5a10aa5fcc7…error: could not compile `probe` (bin <str>) due to 1 previous errorrust/rustc · compiler-diagnostic · outer cargo checkBeweisqualität: complete · Umgebungsvarianten: 1 · Zuerst erfasst: 2026-09-19 · Zuletzt gesehen: 2026-09-19
-
beobachtet UNKNOWN exit 101 Beweislücke ×1 1.4.6 os=linux sha256:a3999c200a2d…Compiling sample-ring v1.0.0 (<path> · warning: unused import: `self` · --> test/contract.rs:<n>:<n> · |cargo · unclassified-diagnostic · outer cargo run · gap stage-unknownBeweisqualität: complete · Umgebungsvarianten: 1 · Zuerst erfasst: 2026-09-19 · Zuletzt gesehen: 2026-09-19Kandidat für diagnostische Neuprüfung
Symbole
Noch keine Symbole mit Evidenz.