Registroscargoanstyle1.0.14anstyle
Mudar as condições
Condições atuais
anstyle @1.0.14ubuntu glibc · x64 · cargo 1
1 de 1 passaram
Observado — builds reais de projetos reportaram desta coordenada.
ainda sem amostra nesta coordenada
- Observações de projetos
- 1 / 1
- Verificações de contrato
- nada nesta coordenada
- Peers independentes que reportaram
- 1
- Último registro
- 2026-10-11
Evidências que você pode abrir
Saúde das dependências
Uma resolução leu a árvore desta versão e não encontrou dependências. Isso é uma medição, não uma medição ausente.
Clusters de falha recentes
-
observado PROJECT_TEST exit 101 ×2 1.0.14 os=linux sha256:a5ae8fd57d8b…error: test failed, to rerun pass `--test contract` · running 0 tests …rust/test · test-runner-diagnostic · outer cargo testQualidade da evidência: complete · Variantes de ambiente: 1 · Primeiro registro: 2026-10-22 · Visto por último: 2026-10-22
-
observado PROJECT_COMPILE exit 101 ×1 1.0.14 os=linux sha256:a6f8d9fae67c…error: could not compile `sample-clap-builder` (bin <str>) due to 1 previous errorrust/rustc · compiler-diagnostic · outer cargo runQualidade da evidência: complete · Variantes de ambiente: 1 · Primeiro registro: 2026-10-11 · Visto por último: 2026-10-11
-
observado PROJECT_COMPILE exit 101 E0596 ×1 1.0.14 os=linux sha256:db4f2e2a82c6…error[E0596]: cannot borrow `subcmd_matches` as mutable, as it is not declared as mutablerust/rustc · compiler-diagnostic · outer cargo runQualidade da evidência: complete · Variantes de ambiente: 1 · Primeiro registro: 2026-10-11 · Visto por último: 2026-10-11
-
observado UNKNOWN exit 101 Lacuna de evidência ×1 1.0.14 os=linux sha256:0bccd108f164…Compiling sample-clap-builder v1.0.0 (<path> · Finished `dev` profile [unoptimized + debuginfo] target(s) in 0.56s · Running `target/debug/contract` …cargo · unclassified-diagnostic · outer cargo run · gap stage-unknownQualidade da evidência: complete · Variantes de ambiente: 1 · Primeiro registro: 2026-10-11 · Visto por último: 2026-10-11Candidato a reverificação diagnóstica
-
observado UNKNOWN exit 101 Lacuna de evidência ×1 1.0.14 os=linux sha256:0efb9ec64cf2…Compiling sample-clap-builder v1.0.0 (<path> · Finished `dev` profile [unoptimized + debuginfo] target(s) in 0.48s · Running `target/debug/contract` …cargo · unclassified-diagnostic · outer cargo run · gap stage-unknownQualidade da evidência: complete · Variantes de ambiente: 1 · Primeiro registro: 2026-10-11 · Visto por último: 2026-10-11Candidato a reverificação diagnóstica
-
observado UNKNOWN exit 101 Lacuna de evidência ×1 1.0.14 os=linux sha256:97de6b0d68a3…Compiling sample-clap-builder v1.0.0 (<path> · Finished `dev` profile [unoptimized + debuginfo] target(s) in 0.50s · Running `target/debug/contract` …cargo · unclassified-diagnostic · outer cargo run · gap stage-unknownQualidade da evidência: complete · Variantes de ambiente: 1 · Primeiro registro: 2026-10-11 · Visto por último: 2026-10-11Candidato a reverificação diagnóstica
-
observado PROJECT_COMPILE exit 101 E0277 ×1 1.0.14 os=linux sha256:53dcbece5154…error[E0277]: the trait bound `Mode: ToString` is not satisfiedrust/rustc · compiler-diagnostic · outer cargo runQualidade da evidência: complete · Variantes de ambiente: 1 · Primeiro registro: 2026-10-22 · Visto por último: 2026-10-22
-
observado PROJECT_COMPILE exit 101 ×1 1.0.14 os=linux sha256:a5322a28337e…error: could not compile `sample-clap-derive` (bin <str>) due to 2 previous errors; 1 warning emittedrust/rustc · compiler-diagnostic · outer cargo runQualidade da evidência: complete · Variantes de ambiente: 1 · Primeiro registro: 2026-10-22 · Visto por último: 2026-10-22
-
observado PROJECT_COMPILE exit 101 E0308 ×1 1.0.14 os=linux sha256:0479254218ac…error[E0308]: mismatched typesrust/rustc · compiler-diagnostic · outer cargo buildQualidade da evidência: complete · Variantes de ambiente: 1 · Primeiro registro: 2026-10-22 · Visto por último: 2026-10-22
-
observado PROJECT_COMPILE exit 101 ×1 1.0.14 os=linux sha256:35354728cb0d…error: could not compile `sample-clap-builder-arg` (bin <str>) due to 1 previous errorrust/rustc · compiler-diagnostic · outer cargo buildQualidade da evidência: complete · Variantes de ambiente: 1 · Primeiro registro: 2026-10-22 · Visto por último: 2026-10-22
-
observado UNKNOWN exit 101 Lacuna de evidência ×1 1.0.14 os=linux sha256:2a68e23ab838…Compiling sample-clap-context-kind v1.0.0 (<path> · Finished `dev` profile [unoptimized + debuginfo] target(s) in 3.26s · Running `target/debug/contract` …cargo · unclassified-diagnostic · outer cargo run · gap stage-unknownQualidade da evidência: complete · Variantes de ambiente: 1 · Primeiro registro: 2026-10-22 · Visto por último: 2026-10-22Candidato a reverificação diagnóstica
-
observado UNKNOWN exit 101 Lacuna de evidência ×1 1.0.14 os=linux sha256:56a18513fc7d…Compiling sample-clap-context-kind v1.0.0 (<path> · Finished `dev` profile [unoptimized + debuginfo] target(s) in 1.88s · Running `target/debug/contract` …cargo · unclassified-diagnostic · outer cargo run · gap stage-unknownQualidade da evidência: complete · Variantes de ambiente: 1 · Primeiro registro: 2026-10-22 · Visto por último: 2026-10-22Candidato a reverificação diagnóstica
Mostrando os 12 mais relatados de 14 grupos de falhas registrados. O resto são relatos únicos.