记录cargoanstyle1.0.14
更改条件
依赖健康度
某次解析读取了该版本的依赖树,没有发现依赖。这是一次测量结果,而不是缺失。
近期失败聚类
-
已观测 PROJECT_TEST exit 101 ×2 1.0.14 os=linux sha256:a5ae8fd57d8b…error: test failed, to rerun pass `--test contract` · running 0 tests …rust/test · test-runner-diagnostic · outer cargo test证据质量: complete · 环境变体: 1 · 首次记录: 2026-10-22 · 最近观测: 2026-10-22
-
已观测 PROJECT_COMPILE exit 101 ×1 1.0.14 os=linux sha256:a6f8d9fae67c…error: could not compile `sample-clap-builder` (bin <str>) due to 1 previous errorrust/rustc · compiler-diagnostic · outer cargo run证据质量: complete · 环境变体: 1 · 首次记录: 2026-10-11 · 最近观测: 2026-10-11
-
已观测 PROJECT_COMPILE exit 101 E0596 ×1 1.0.14 os=linux sha256:db4f2e2a82c6…error[E0596]: cannot borrow `subcmd_matches` as mutable, as it is not declared as mutablerust/rustc · compiler-diagnostic · outer cargo run证据质量: complete · 环境变体: 1 · 首次记录: 2026-10-11 · 最近观测: 2026-10-11
-
已观测 UNKNOWN exit 101 证据缺口 ×1 1.0.14 os=linux sha256:0bccd108f164…Compiling sample-clap-builder v1.0.0 (<path> · Finished `dev` profile [unoptimized + debuginfo] target(s) in 0.56s · Running `target/debug/contract` …cargo · unclassified-diagnostic · outer cargo run · gap stage-unknown证据质量: complete · 环境变体: 1 · 首次记录: 2026-10-11 · 最近观测: 2026-10-11诊断复验候选
-
已观测 UNKNOWN exit 101 证据缺口 ×1 1.0.14 os=linux sha256:0efb9ec64cf2…Compiling sample-clap-builder v1.0.0 (<path> · Finished `dev` profile [unoptimized + debuginfo] target(s) in 0.48s · Running `target/debug/contract` …cargo · unclassified-diagnostic · outer cargo run · gap stage-unknown证据质量: complete · 环境变体: 1 · 首次记录: 2026-10-11 · 最近观测: 2026-10-11诊断复验候选
-
已观测 UNKNOWN exit 101 证据缺口 ×1 1.0.14 os=linux sha256:97de6b0d68a3…Compiling sample-clap-builder v1.0.0 (<path> · Finished `dev` profile [unoptimized + debuginfo] target(s) in 0.50s · Running `target/debug/contract` …cargo · unclassified-diagnostic · outer cargo run · gap stage-unknown证据质量: complete · 环境变体: 1 · 首次记录: 2026-10-11 · 最近观测: 2026-10-11诊断复验候选
-
已观测 PROJECT_COMPILE exit 101 E0277 ×1 1.0.14 os=linux sha256:53dcbece5154…error[E0277]: the trait bound `Mode: ToString` is not satisfiedrust/rustc · compiler-diagnostic · outer cargo run证据质量: complete · 环境变体: 1 · 首次记录: 2026-10-22 · 最近观测: 2026-10-22
-
已观测 PROJECT_COMPILE exit 101 ×1 1.0.14 os=linux sha256:a5322a28337e…error: could not compile `sample-clap-derive` (bin <str>) due to 2 previous errors; 1 warning emittedrust/rustc · compiler-diagnostic · outer cargo run证据质量: complete · 环境变体: 1 · 首次记录: 2026-10-22 · 最近观测: 2026-10-22
-
已观测 PROJECT_COMPILE exit 101 E0308 ×1 1.0.14 os=linux sha256:0479254218ac…error[E0308]: mismatched typesrust/rustc · compiler-diagnostic · outer cargo build证据质量: complete · 环境变体: 1 · 首次记录: 2026-10-22 · 最近观测: 2026-10-22
-
已观测 PROJECT_COMPILE exit 101 ×1 1.0.14 os=linux sha256:35354728cb0d…error: could not compile `sample-clap-builder-arg` (bin <str>) due to 1 previous errorrust/rustc · compiler-diagnostic · outer cargo build证据质量: complete · 环境变体: 1 · 首次记录: 2026-10-22 · 最近观测: 2026-10-22
-
已观测 UNKNOWN exit 101 证据缺口 ×1 1.0.14 os=linux sha256:2a68e23ab838…Compiling sample-clap-context-kind v1.0.0 (<path> · Finished `dev` profile [unoptimized + debuginfo] target(s) in 3.26s · Running `target/debug/contract` …cargo · unclassified-diagnostic · outer cargo run · gap stage-unknown证据质量: complete · 环境变体: 1 · 首次记录: 2026-10-22 · 最近观测: 2026-10-22诊断复验候选
-
已观测 UNKNOWN exit 101 证据缺口 ×1 1.0.14 os=linux sha256:56a18513fc7d…Compiling sample-clap-context-kind v1.0.0 (<path> · Finished `dev` profile [unoptimized + debuginfo] target(s) in 1.88s · Running `target/debug/contract` …cargo · unclassified-diagnostic · outer cargo run · gap stage-unknown证据质量: complete · 环境变体: 1 · 首次记录: 2026-10-22 · 最近观测: 2026-10-22诊断复验候选
显示报告最多的 12 个。此坐标记录的失败聚类共 14 个。其余为单次报告。