記録cargoanstyle1.0.14
条件を変更
現在の条件
anstyle @1.0.14alpine musl · x64 · rust 1 · cargo · rust
API ではなくパッケージ全体の合計
1 回中 1 回が成功
検証 — このネットワークがこの座標でコントラクトを実行しました。
サンプルあり — この座標で実行し、問題なく終わった (1)
- プロジェクト観測
- 4 / 4
- コントラクト検証
- 1 / 1
- 使用記録
- 2
- 独立した報告ピア
- 1
- 最終記録
- 2026-10-13
開ける証拠
依存関係のヘルス
ある解決処理がこのリリースのツリーを読み、依存関係はありませんでした。欠落ではなく測定結果です。
最近の失敗クラスター
-
観測済み PROJECT_TEST exit 101 ×2 1.0.14 os=linux sha256:a5ae8fd57d8b…error: test failed, to rerun pass `--test contract` · running 0 tests …rust/test · test-runner-diagnostic · outer cargo test証拠品質: complete · 環境バリアント: 1 · 初回記録: 2026-10-22 · 最終観測: 2026-10-22
-
観測済み PROJECT_COMPILE exit 101 ×1 1.0.14 os=linux sha256:a6f8d9fae67c…error: could not compile `sample-clap-builder` (bin <str>) due to 1 previous errorrust/rustc · compiler-diagnostic · outer cargo run証拠品質: complete · 環境バリアント: 1 · 初回記録: 2026-10-11 · 最終観測: 2026-10-11
-
観測済み PROJECT_COMPILE exit 101 E0596 ×1 1.0.14 os=linux sha256:db4f2e2a82c6…error[E0596]: cannot borrow `subcmd_matches` as mutable, as it is not declared as mutablerust/rustc · compiler-diagnostic · outer cargo run証拠品質: complete · 環境バリアント: 1 · 初回記録: 2026-10-11 · 最終観測: 2026-10-11
-
観測済み UNKNOWN exit 101 証拠の欠落 ×1 1.0.14 os=linux sha256:0bccd108f164…Compiling sample-clap-builder v1.0.0 (<path> · Finished `dev` profile [unoptimized + debuginfo] target(s) in 0.56s · Running `target/debug/contract` …cargo · unclassified-diagnostic · outer cargo run · gap stage-unknown証拠品質: complete · 環境バリアント: 1 · 初回記録: 2026-10-11 · 最終観測: 2026-10-11診断再検証候補
-
観測済み UNKNOWN exit 101 証拠の欠落 ×1 1.0.14 os=linux sha256:0efb9ec64cf2…Compiling sample-clap-builder v1.0.0 (<path> · Finished `dev` profile [unoptimized + debuginfo] target(s) in 0.48s · Running `target/debug/contract` …cargo · unclassified-diagnostic · outer cargo run · gap stage-unknown証拠品質: complete · 環境バリアント: 1 · 初回記録: 2026-10-11 · 最終観測: 2026-10-11診断再検証候補
-
観測済み UNKNOWN exit 101 証拠の欠落 ×1 1.0.14 os=linux sha256:97de6b0d68a3…Compiling sample-clap-builder v1.0.0 (<path> · Finished `dev` profile [unoptimized + debuginfo] target(s) in 0.50s · Running `target/debug/contract` …cargo · unclassified-diagnostic · outer cargo run · gap stage-unknown証拠品質: complete · 環境バリアント: 1 · 初回記録: 2026-10-11 · 最終観測: 2026-10-11診断再検証候補
-
観測済み PROJECT_COMPILE exit 101 E0277 ×1 1.0.14 os=linux sha256:53dcbece5154…error[E0277]: the trait bound `Mode: ToString` is not satisfiedrust/rustc · compiler-diagnostic · outer cargo run証拠品質: complete · 環境バリアント: 1 · 初回記録: 2026-10-22 · 最終観測: 2026-10-22
-
観測済み PROJECT_COMPILE exit 101 ×1 1.0.14 os=linux sha256:a5322a28337e…error: could not compile `sample-clap-derive` (bin <str>) due to 2 previous errors; 1 warning emittedrust/rustc · compiler-diagnostic · outer cargo run証拠品質: complete · 環境バリアント: 1 · 初回記録: 2026-10-22 · 最終観測: 2026-10-22
-
観測済み PROJECT_COMPILE exit 101 E0308 ×1 1.0.14 os=linux sha256:0479254218ac…error[E0308]: mismatched typesrust/rustc · compiler-diagnostic · outer cargo build証拠品質: complete · 環境バリアント: 1 · 初回記録: 2026-10-22 · 最終観測: 2026-10-22
-
観測済み PROJECT_COMPILE exit 101 ×1 1.0.14 os=linux sha256:35354728cb0d…error: could not compile `sample-clap-builder-arg` (bin <str>) due to 1 previous errorrust/rustc · compiler-diagnostic · outer cargo build証拠品質: complete · 環境バリアント: 1 · 初回記録: 2026-10-22 · 最終観測: 2026-10-22
-
観測済み UNKNOWN exit 101 証拠の欠落 ×1 1.0.14 os=linux sha256:2a68e23ab838…Compiling sample-clap-context-kind v1.0.0 (<path> · Finished `dev` profile [unoptimized + debuginfo] target(s) in 3.26s · Running `target/debug/contract` …cargo · unclassified-diagnostic · outer cargo run · gap stage-unknown証拠品質: complete · 環境バリアント: 1 · 初回記録: 2026-10-22 · 最終観測: 2026-10-22診断再検証候補
-
観測済み UNKNOWN exit 101 証拠の欠落 ×1 1.0.14 os=linux sha256:56a18513fc7d…Compiling sample-clap-context-kind v1.0.0 (<path> · Finished `dev` profile [unoptimized + debuginfo] target(s) in 1.88s · Running `target/debug/contract` …cargo · unclassified-diagnostic · outer cargo run · gap stage-unknown証拠品質: complete · 環境バリアント: 1 · 初回記録: 2026-10-22 · 最終観測: 2026-10-22診断再検証候補
最も多く報告された 12 件を表示しています。この座標に記録された失敗クラスタは 14 件です。残りは単発の報告です。