Recordscargoanstyle1.0.14
Change the conditions
Current conditions
anstyle @1.0.14alpine musl · x64 · rust 1 · cargo · rust
package-level total, not an API
1 of 1 passed
Verified — this network ran a contract at this coordinate.
there is a sample here, and our run of it at this coordinate came back clean (1)
- Project observations
- 4 / 4
- Contract verifications
- 1 / 1
- Usage records
- 2
- Independent reporting peers
- 1
- Last recorded
- 2026-10-13
Evidence you can open
Dependency Health
A resolution read this release's tree and found no dependencies. That is a measurement, not a missing one.
Recent failure clusters
-
observed PROJECT_TEST exit 101 ×2 1.0.14 os=linux sha256:a5ae8fd57d8b…error: test failed, to rerun pass `--test contract` · running 0 tests …rust/test · test-runner-diagnostic · outer cargo testEvidence quality: complete · Environment variants: 1 · First recorded: 2026-10-22 · Last seen: 2026-10-22
-
observed PROJECT_COMPILE exit 101 ×1 1.0.14 os=linux sha256:a6f8d9fae67c…error: could not compile `sample-clap-builder` (bin <str>) due to 1 previous errorrust/rustc · compiler-diagnostic · outer cargo runEvidence quality: complete · Environment variants: 1 · First recorded: 2026-10-11 · Last seen: 2026-10-11
-
observed PROJECT_COMPILE exit 101 E0596 ×1 1.0.14 os=linux sha256:db4f2e2a82c6…error[E0596]: cannot borrow `subcmd_matches` as mutable, as it is not declared as mutablerust/rustc · compiler-diagnostic · outer cargo runEvidence quality: complete · Environment variants: 1 · First recorded: 2026-10-11 · Last seen: 2026-10-11
-
observed UNKNOWN exit 101 Evidence gap ×1 1.0.14 os=linux sha256:0bccd108f164…Compiling sample-clap-builder v1.0.0 (<path> · Finished `dev` profile [unoptimized + debuginfo] target(s) in 0.56s · Running `target/debug/contract` …cargo · unclassified-diagnostic · outer cargo run · gap stage-unknownEvidence quality: complete · Environment variants: 1 · First recorded: 2026-10-11 · Last seen: 2026-10-11Diagnostic re-verification candidate
-
observed UNKNOWN exit 101 Evidence gap ×1 1.0.14 os=linux sha256:0efb9ec64cf2…Compiling sample-clap-builder v1.0.0 (<path> · Finished `dev` profile [unoptimized + debuginfo] target(s) in 0.48s · Running `target/debug/contract` …cargo · unclassified-diagnostic · outer cargo run · gap stage-unknownEvidence quality: complete · Environment variants: 1 · First recorded: 2026-10-11 · Last seen: 2026-10-11Diagnostic re-verification candidate
-
observed UNKNOWN exit 101 Evidence gap ×1 1.0.14 os=linux sha256:97de6b0d68a3…Compiling sample-clap-builder v1.0.0 (<path> · Finished `dev` profile [unoptimized + debuginfo] target(s) in 0.50s · Running `target/debug/contract` …cargo · unclassified-diagnostic · outer cargo run · gap stage-unknownEvidence quality: complete · Environment variants: 1 · First recorded: 2026-10-11 · Last seen: 2026-10-11Diagnostic re-verification candidate
-
observed PROJECT_COMPILE exit 101 E0277 ×1 1.0.14 os=linux sha256:53dcbece5154…error[E0277]: the trait bound `Mode: ToString` is not satisfiedrust/rustc · compiler-diagnostic · outer cargo runEvidence quality: complete · Environment variants: 1 · First recorded: 2026-10-22 · Last seen: 2026-10-22
-
observed PROJECT_COMPILE exit 101 ×1 1.0.14 os=linux sha256:a5322a28337e…error: could not compile `sample-clap-derive` (bin <str>) due to 2 previous errors; 1 warning emittedrust/rustc · compiler-diagnostic · outer cargo runEvidence quality: complete · Environment variants: 1 · First recorded: 2026-10-22 · Last seen: 2026-10-22
-
observed PROJECT_COMPILE exit 101 E0308 ×1 1.0.14 os=linux sha256:0479254218ac…error[E0308]: mismatched typesrust/rustc · compiler-diagnostic · outer cargo buildEvidence quality: complete · Environment variants: 1 · First recorded: 2026-10-22 · Last seen: 2026-10-22
-
observed PROJECT_COMPILE exit 101 ×1 1.0.14 os=linux sha256:35354728cb0d…error: could not compile `sample-clap-builder-arg` (bin <str>) due to 1 previous errorrust/rustc · compiler-diagnostic · outer cargo buildEvidence quality: complete · Environment variants: 1 · First recorded: 2026-10-22 · Last seen: 2026-10-22
-
observed UNKNOWN exit 101 Evidence gap ×1 1.0.14 os=linux sha256:2a68e23ab838…Compiling sample-clap-context-kind v1.0.0 (<path> · Finished `dev` profile [unoptimized + debuginfo] target(s) in 3.26s · Running `target/debug/contract` …cargo · unclassified-diagnostic · outer cargo run · gap stage-unknownEvidence quality: complete · Environment variants: 1 · First recorded: 2026-10-22 · Last seen: 2026-10-22Diagnostic re-verification candidate
-
observed UNKNOWN exit 101 Evidence gap ×1 1.0.14 os=linux sha256:56a18513fc7d…Compiling sample-clap-context-kind v1.0.0 (<path> · Finished `dev` profile [unoptimized + debuginfo] target(s) in 1.88s · Running `target/debug/contract` …cargo · unclassified-diagnostic · outer cargo run · gap stage-unknownEvidence quality: complete · Environment variants: 1 · First recorded: 2026-10-22 · Last seen: 2026-10-22Diagnostic re-verification candidate
Showing the 12 most-reported of 14 recorded failure clusters. The rest are single reports.